{"text_format":"1","workbook":"xlsx","n_sheets":6,"sheets":["dashboard","data","control","calcs","charts","map icon"],"not_rendered":{"charts":3,"images":4,"macros":1,"external_links":0,"defined_names":19,"comments":0,"pivot_tables":0},"unopened":[],"bounds":{"document_bytes":16777216,"sheet_cells":100000,"rows_first":2000,"rows_last":500,"rows_between":2000,"halvings":0,"cell_chars":16384,"cell_head_chars":4096},"cells_cut":0,"cells_raw":0,"read":"whole","date_system":"1900"}

{"sheet":"dashboard","index":0,"n_rows":41,"n_cols":29,"rows_kept":41,"cut":false,"hidden":false,"merged":[[25,1,25,11],[6,13,6,18],[6,20,6,23],[1,1,3,10],[1,18,3,20],[1,21,3,21]]}
[]
[null,"European Union Unemployment Rates",null,null,null,null,null,null,null,null,null,null,null,null,null,"Country",null,null,{"$f":"calcs!D38","v":"Germany"},null,null,{"$f":"calcs!$D$40","v":"2009-01-01"}]
[null,null,null,null,null,null,null,null,null,null,null,null,null,null,null,"Year",null,null,null,null,null,null,null,null,null,null,null,null,"www.cs-analytics.de"]
[null,null,null,null,null,null,null,null,null,null,null,null,null,null,null,"Age group"]
[]
[]
[null,null,null,"Band Chart",null,null,null,"Line Chart",null,null,null,null,null,{"$f":"\"Sorted Bar Chart (\"&YEAR(calcs!$D$40)&\")\"","v":"Sorted Bar Chart (2009)"},null,null,null,null,null,null,{"$f":"\"Choropleth Map (\"&YEAR(calcs!$D$40)&\")\"","v":"Choropleth Map (2009)"},null,null,null,"Color scale"]
[]
[null,null,null,null,null,null,null,null,null,null,null,null,null,null,null,"click on a country to select",null,null,null,null,"click on a country to select"]
[]
[null,null,null,null,null,null,null,null,null,null,null,null,null,null,{"$f":"calcs!B45","v":1},{"$f":"calcs!H45","v":"Spain"}]
[null,null,null,null,null,null,null,null,null,null,null,null,null,null,{"$f":"calcs!B46","v":2},{"$f":"calcs!H46","v":"Latvia"}]
[null,null,null,null,null,null,null,null,null,null,null,null,null,null,{"$f":"calcs!B47","v":3},{"$f":"calcs!H47","v":"Lithuania"}]
[null,null,null,null,null,null,null,null,null,null,null,null,null,null,{"$f":"calcs!B48","v":4},{"$f":"calcs!H48","v":"Estonia"}]
[null,null,null,null,null,null,null,null,null,null,null,null,null,null,{"$f":"calcs!B49","v":5},{"$f":"calcs!H49","v":"Slovakia"}]
[null,null,null,null,null,null,null,null,null,null,null,null,null,null,{"$f":"calcs!B50","v":6},{"$f":"calcs!H50","v":"Ireland"}]
[null,null,null,null,null,null,null,null,null,null,null,null,null,null,{"$f":"calcs!B51","v":7},{"$f":"calcs!H51","v":"Portugal"}]
[null,null,null,null,null,null,null,null,null,null,null,null,null,null,{"$f":"calcs!B52","v":8},{"$f":"calcs!H52","v":"Hungary"}]
[null,null,null,null,null,null,null,null,null,null,null,null,null,null,{"$f":"calcs!B53","v":9},{"$f":"calcs!H53","v":"Greece"}]
[null,null,null,null,null,null,null,null,null,null,null,null,null,null,{"$f":"calcs!B54","v":10},{"$f":"calcs!H54","v":"Croatia"}]
[null,null,null,null,null,null,null,null,null,null,null,null,null,null,{"$f":"calcs!B55","v":11},{"$f":"calcs!H55","v":"France"}]
[null,null,null,null,null,null,null,null,null,null,null,null,null,null,{"$f":"calcs!B56","v":12},{"$f":"calcs!H56","v":"Germany"}]
[null,null,null,null,null,null,null,null,null,null,null,null,null,null,{"$f":"calcs!B57","v":13},{"$f":"calcs!H57","v":"Poland"}]
[null,null,null,null,null,null,null,null,null,null,null,null,null,null,{"$f":"calcs!B58","v":14},{"$f":"calcs!H58","v":"Belgium"}]
[null,null,null,null,null,null,null,null,null,null,null,null,null,null,{"$f":"calcs!B59","v":15},{"$f":"calcs!H59","v":"Italy"}]
[null,"Scrollable Data Table",null,null,null,null,null,null,null,null,null,null,null,null,{"$f":"calcs!B60","v":16},{"$f":"calcs!H60","v":"Finland"}]
[null,"click on a country or year to select",null,null,null,null,null,null,null,null,null,null,null,null,{"$f":"calcs!B61","v":17},{"$f":"calcs!H61","v":"Bulgaria"}]
[null,{"$f":"calcs!C123","v":"Country"},{"$f":"calcs!D123","v":"2005-01-01"},{"$f":"calcs!E123","v":"2006-01-01"},{"$f":"calcs!F123","v":"2007-01-01"},{"$f":"calcs!G123","v":"2008-01-01"},{"$f":"calcs!H123","v":"2009-01-01"},{"$f":"calcs!I123","v":"2010-01-01"},{"$f":"calcs!J123","v":"2011-01-01"},{"$f":"calcs!K123","v":"2012-01-01"},{"$f":"calcs!L123","v":"2013-01-01"},{"$f":"calcs!M123","v":"2014-01-01"},null,null,{"$f":"calcs!B62","v":18},{"$f":"calcs!H62","v":"Sweden"}]
[null,{"$f":"calcs!C124","v":"Denmark"},{"$f":"calcs!D124","v":4.2000000000000003E-2},{"$f":"calcs!E124","v":3.2000000000000001E-2},{"$f":"calcs!F124","v":3.2000000000000001E-2},{"$f":"calcs!G124","v":2.6000000000000002E-2},{"$f":"calcs!H124","v":4.9000000000000002E-2},{"$f":"calcs!I124","v":6.3E-2},{"$f":"calcs!J124","v":6.3E-2},{"$f":"calcs!K124","v":6.3E-2},{"$f":"calcs!L124","v":5.9000000000000004E-2},{"$f":"calcs!M124","v":5.5E-2},null,null,{"$f":"calcs!B63","v":19},{"$f":"calcs!H63","v":"Czech Republic"},null,null,null,null,null,null,null,null,null,null,null,null,"not EU"]
[null,{"$f":"calcs!C125","v":"Estonia"},{"$f":"calcs!D125","v":7.2000000000000008E-2},{"$f":"calcs!E125","v":5.2000000000000005E-2},{"$f":"calcs!F125","v":3.9E-2},{"$f":"calcs!G125","v":4.5999999999999999E-2},{"$f":"calcs!H125","v":0.11900000000000001},{"$f":"calcs!I125","v":0.14899999999999999},{"$f":"calcs!J125","v":0.11199999999999999},{"$f":"calcs!K125","v":8.900000000000001E-2},{"$f":"calcs!L125","v":7.5999999999999998E-2},{"$f":"calcs!M125","v":6.7000000000000004E-2},null,null,{"$f":"calcs!B64","v":20},{"$f":"calcs!H64","v":"United Kingdom"},null,null,null,null,null,null,null,null,null,null,null,{"$f":"IF(AC30=calcs!$D$171,\"t\",\"\")","v":""},{"$f":"control!E47","v":"no data"}]
[null,{"$f":"calcs!C126","v":"Finland"},{"$f":"calcs!D126","v":6.8000000000000005E-2},{"$f":"calcs!E126","v":6.2E-2},{"$f":"calcs!F126","v":5.4000000000000006E-2},{"$f":"calcs!G126","v":4.9000000000000002E-2},{"$f":"calcs!H126","v":6.4000000000000001E-2},{"$f":"calcs!I126","v":6.6000000000000003E-2},{"$f":"calcs!J126","v":6.0999999999999999E-2},{"$f":"calcs!K126","v":6.0999999999999999E-2},{"$f":"calcs!L126","v":6.5000000000000002E-2},{"$f":"calcs!M126","v":7.0000000000000007E-2},null,null,{"$f":"calcs!B65","v":21},{"$f":"calcs!H65","v":"Malta"},null,null,null,null,null,null,null,null,null,null,null,{"$f":"IF(AC31=calcs!$D$171,\"t\",\"\")","v":""},{"$f":"control!E48","v":"0% to 2%"}]
[null,{"$f":"calcs!C127","v":"France"},{"$f":"calcs!D127","v":7.4999999999999997E-2},{"$f":"calcs!E127","v":7.2999999999999995E-2},{"$f":"calcs!F127","v":6.7000000000000004E-2},{"$f":"calcs!G127","v":6.0999999999999999E-2},{"$f":"calcs!H127","v":7.400000000000001E-2},{"$f":"calcs!I127","v":7.6999999999999999E-2},{"$f":"calcs!J127","v":7.6999999999999999E-2},{"$f":"calcs!K127","v":8.199999999999999E-2},{"$f":"calcs!L127","v":8.6999999999999994E-2},{"$f":"calcs!M127","v":8.6999999999999994E-2},null,null,{"$f":"calcs!B66","v":22},{"$f":"calcs!H66","v":"Romania"},null,null,null,null,null,null,null,null,null,null,null,{"$f":"IF(AC32=calcs!$D$171,\"t\",\"\")","v":""},{"$f":"control!E49","v":"2% to 4%"}]
[null,{"$f":"calcs!C128","v":"Germany"},{"$f":"calcs!D128","v":0.106},{"$f":"calcs!E128","v":9.6999999999999989E-2},{"$f":"calcs!F128","v":8.1000000000000003E-2},{"$f":"calcs!G128","v":7.0000000000000007E-2},{"$f":"calcs!H128","v":7.2000000000000008E-2},{"$f":"calcs!I128","v":6.6000000000000003E-2},{"$f":"calcs!J128","v":5.5E-2},{"$f":"calcs!K128","v":5.0999999999999997E-2},{"$f":"calcs!L128","v":4.9000000000000002E-2},{"$f":"calcs!M128","v":4.7E-2},null,null,{"$f":"calcs!B67","v":23},{"$f":"calcs!H67","v":"Slovenia"},null,null,null,null,null,null,null,null,null,null,null,{"$f":"IF(AC33=calcs!$D$171,\"t\",\"\")","v":""},{"$f":"control!E50","v":"4% to 6%"}]
[null,{"$f":"calcs!C129","v":"Greece"},{"$f":"calcs!D129","v":8.4000000000000005E-2},{"$f":"calcs!E129","v":7.4999999999999997E-2},{"$f":"calcs!F129","v":7.2000000000000008E-2},{"$f":"calcs!G129","v":6.6000000000000003E-2},{"$f":"calcs!H129","v":8.4000000000000005E-2},{"$f":"calcs!I129","v":0.11199999999999999},{"$f":"calcs!J129","v":0.159},{"$f":"calcs!K129","v":0.223},{"$f":"calcs!L129","v":0.254},{"$f":"calcs!M129","v":0.248},null,null,{"$f":"calcs!B68","v":24},{"$f":"calcs!H68","v":"Denmark"},null,null,null,null,null,null,null,null,null,null,null,{"$f":"IF(AC34=calcs!$D$171,\"t\",\"\")","v":"t"},{"$f":"control!E51","v":"6% to 8%"}]
[null,{"$f":"calcs!C130","v":"Hungary"},{"$f":"calcs!D130","v":6.0999999999999999E-2},{"$f":"calcs!E130","v":6.5000000000000002E-2},{"$f":"calcs!F130","v":6.5000000000000002E-2},{"$f":"calcs!G130","v":6.9000000000000006E-2},{"$f":"calcs!H130","v":8.8000000000000009E-2},{"$f":"calcs!I130","v":0.1},{"$f":"calcs!J130","v":9.9000000000000005E-2},{"$f":"calcs!K130","v":9.6999999999999989E-2},{"$f":"calcs!L130","v":8.900000000000001E-2},{"$f":"calcs!M130","v":6.7000000000000004E-2},null,null,{"$f":"calcs!B69","v":25},{"$f":"calcs!H69","v":"Cyprus"},null,null,null,null,null,null,null,null,null,null,null,{"$f":"IF(AC35=calcs!$D$171,\"t\",\"\")","v":""},{"$f":"control!E52","v":"8% to 10%"}]
[null,{"$f":"calcs!C131","v":"Ireland"},{"$f":"calcs!D131","v":3.5000000000000003E-2},{"$f":"calcs!E131","v":3.7000000000000005E-2},{"$f":"calcs!F131","v":3.7999999999999999E-2},{"$f":"calcs!G131","v":5.2000000000000005E-2},{"$f":"calcs!H131","v":0.10099999999999999},{"$f":"calcs!I131","v":0.12},{"$f":"calcs!J131","v":0.129},{"$f":"calcs!K131","v":0.129},{"$f":"calcs!L131","v":0.11599999999999999},{"$f":"calcs!M131","v":0.1},null,null,{"$f":"calcs!B70","v":26},{"$f":"calcs!H70","v":"Austria"},null,null,null,null,null,null,null,null,null,null,null,{"$f":"IF(AC36=calcs!$D$171,\"t\",\"\")","v":""},{"$f":"control!E53","v":"10% to 12%"}]
[null,{"$f":"calcs!C132","v":"Italy"},{"$f":"calcs!D132","v":6.2E-2},{"$f":"calcs!E132","v":5.5E-2},{"$f":"calcs!F132","v":4.9000000000000002E-2},{"$f":"calcs!G132","v":5.5999999999999994E-2},{"$f":"calcs!H132","v":6.4000000000000001E-2},{"$f":"calcs!I132","v":6.9000000000000006E-2},{"$f":"calcs!J132","v":6.9000000000000006E-2},{"$f":"calcs!K132","v":8.900000000000001E-2},{"$f":"calcs!L132","v":0.10199999999999999},{"$f":"calcs!M132","v":0.106},null,null,{"$f":"calcs!B71","v":27},{"$f":"calcs!H71","v":"Luxembourg"},null,null,null,null,null,null,null,null,null,null,null,{"$f":"IF(AC37=calcs!$D$171,\"t\",\"\")","v":""},{"$f":"control!E54","v":"12% to 14%"}]
[null,{"$f":"calcs!C133","v":"Latvia"},{"$f":"calcs!D133","v":9.3000000000000013E-2},{"$f":"calcs!E133","v":6.0999999999999999E-2},{"$f":"calcs!F133","v":5.4000000000000006E-2},{"$f":"calcs!G133","v":6.9000000000000006E-2},{"$f":"calcs!H133","v":0.154},{"$f":"calcs!I133","v":0.17399999999999999},{"$f":"calcs!J133","v":0.14599999999999999},{"$f":"calcs!K133","v":0.13600000000000001},{"$f":"calcs!L133","v":0.107},{"$f":"calcs!M133","v":0.1},null,null,{"$f":"calcs!B72","v":28},{"$f":"calcs!H72","v":"Netherlands"},null,null,null,null,null,null,null,null,null,null,null,{"$f":"IF(AC38=calcs!$D$171,\"t\",\"\")","v":""},{"$f":"control!E55","v":"14% to 16%"}]
[null,null,null,null,null,null,null,null,null,null,null,null,null,null,null,null,null,null,null,null,null,null,null,null,null,null,null,{"$f":"IF(AC39=calcs!$D$171,\"t\",\"\")","v":""},{"$f":"control!E56","v":"16% or more"}]
[]
[null,{"$f":"data!V2","v":"source: EuroStat"},{"$f":"data!X2","v":"http://ec.europa.eu/eurostat/en"}]

{"sheet":"data","index":1,"n_rows":66,"n_cols":28,"rows_kept":66,"cut":false,"hidden":false,"merged":[]}
[]
[null,"EU Unemployment Rates by Country",null,null,null,null,null,null,null,null,null,null,null,null,null,null,null,null,null,null,null,"source: EuroStat",null,"http://ec.europa.eu/eurostat/en"]
[]
[null,"Age group 25 to 74"]
[]
[null,"Country",null,"1990-01-01","1991-01-01","1992-01-01","1993-01-01","1994-01-01","1995-01-01","1996-01-01","1997-01-01","1998-01-01","1999-01-01","2000-01-01","2001-01-01","2002-01-01","2003-01-01","2004-01-01","2005-01-01","2006-01-01","2007-01-01","2008-01-01","2009-01-01","2010-01-01","2011-01-01","2012-01-01","2013-01-01","2014-01-01"]
[null,"Austria",null,null,null,null,null,3.5000000000000003E-2,3.6000000000000004E-2,0.04,0.04,4.2000000000000003E-2,3.7000000000000005E-2,3.4000000000000002E-2,3.3000000000000002E-2,3.7999999999999999E-2,3.7000000000000005E-2,4.7E-2,4.7E-2,4.4999999999999998E-2,4.0999999999999995E-2,3.4000000000000002E-2,4.4000000000000004E-2,4.0999999999999995E-2,3.9E-2,4.2000000000000003E-2,4.7E-2]
[null,"Belgium",null,5.4000000000000006E-2,5.4000000000000006E-2,0.06,7.0999999999999994E-2,8.1000000000000003E-2,8.1000000000000003E-2,8.1000000000000003E-2,7.8E-2,0.08,7.0999999999999994E-2,5.7999999999999996E-2,5.4000000000000006E-2,6.4000000000000001E-2,6.7000000000000004E-2,7.0000000000000007E-2,7.0999999999999994E-2,7.0000000000000007E-2,6.3E-2,5.9000000000000004E-2,6.6000000000000003E-2,7.0000000000000007E-2,0.06,6.4000000000000001E-2,7.0999999999999994E-2,7.2999999999999995E-2]
[null,"Bulgaria",null,null,null,null,null,null,null,null,null,null,null,0.14499999999999999,0.17199999999999999,0.16200000000000001,0.124,0.10800000000000001,0.09,8.1000000000000003E-2,6.2E-2,0.05,6.0999999999999999E-2,9.3000000000000013E-2,0.10099999999999999,0.11,0.11800000000000001,0.10800000000000001]
[null,"Croatia",null,null,null,null,null,null,null,null,null,null,null,0.125,0.121,0.121,0.113,0.114,0.105,9.6000000000000002E-2,8.199999999999999E-2,6.9000000000000006E-2,7.4999999999999997E-2,9.5000000000000001E-2,0.11599999999999999,0.13699999999999998,0.14400000000000002,0.14300000000000002]
[null,"Cyprus",null,null,null,null,null,null,null,null,null,null,null,4.2000000000000003E-2,3.4000000000000002E-2,0.03,3.6000000000000004E-2,0.04,4.2999999999999997E-2,3.9E-2,3.3000000000000002E-2,3.1E-2,4.4000000000000004E-2,5.0999999999999997E-2,6.4000000000000001E-2,0.10199999999999999,0.13600000000000001,0.14000000000000001]
[null,"Czech Republic",null,null,null,null,3.5000000000000003E-2,3.4000000000000002E-2,3.3000000000000002E-2,3.2000000000000001E-2,4.0999999999999995E-2,5.2999999999999999E-2,7.2000000000000008E-2,7.400000000000001E-2,6.9000000000000006E-2,6.2E-2,6.6000000000000003E-2,7.0000000000000007E-2,6.8000000000000005E-2,6.2E-2,4.8000000000000001E-2,3.9E-2,5.7999999999999996E-2,6.4000000000000001E-2,5.9000000000000004E-2,0.06,6.0999999999999999E-2,5.4000000000000006E-2]
[null,"Denmark",null,6.4000000000000001E-2,7.2000000000000008E-2,7.9000000000000001E-2,8.900000000000001E-2,7.2000000000000008E-2,6.0999999999999999E-2,5.5999999999999994E-2,4.7E-2,4.4000000000000004E-2,4.4000000000000004E-2,0.04,3.9E-2,4.0999999999999995E-2,4.8000000000000001E-2,5.0999999999999997E-2,4.2000000000000003E-2,3.2000000000000001E-2,3.2000000000000001E-2,2.6000000000000002E-2,4.9000000000000002E-2,6.3E-2,6.3E-2,6.3E-2,5.9000000000000004E-2,5.5E-2]
[null,"Estonia",null,null,null,null,null,null,null,null,null,null,null,0.13400000000000001,0.11900000000000001,0.105,0.09,8.4000000000000005E-2,7.2000000000000008E-2,5.2000000000000005E-2,3.9E-2,4.5999999999999999E-2,0.11900000000000001,0.14899999999999999,0.11199999999999999,8.900000000000001E-2,7.5999999999999998E-2,6.7000000000000004E-2]
[null,"Finland",null,2.1000000000000001E-2,5.0999999999999997E-2,9.6000000000000002E-2,0.14099999999999999,0.14499999999999999,0.13699999999999998,0.13,0.11,9.6999999999999989E-2,8.5999999999999993E-2,8.1000000000000003E-2,7.5999999999999998E-2,7.400000000000001E-2,7.2000000000000008E-2,7.2000000000000008E-2,6.8000000000000005E-2,6.2E-2,5.4000000000000006E-2,4.9000000000000002E-2,6.4000000000000001E-2,6.6000000000000003E-2,6.0999999999999999E-2,6.0999999999999999E-2,6.5000000000000002E-2,7.0000000000000007E-2]
[null,"France",null,5.2000000000000005E-2,5.2000000000000005E-2,5.7000000000000002E-2,6.0999999999999999E-2,6.3E-2,6.2E-2,6.3E-2,6.3E-2,6.0999999999999999E-2,0.06,5.2000000000000005E-2,4.8000000000000001E-2,4.7E-2,7.2999999999999995E-2,7.4999999999999997E-2,7.4999999999999997E-2,7.2999999999999995E-2,6.7000000000000004E-2,6.0999999999999999E-2,7.400000000000001E-2,7.6999999999999999E-2,7.6999999999999999E-2,8.199999999999999E-2,8.6999999999999994E-2,8.6999999999999994E-2]
[null,"Germany",null,null,5.5E-2,6.6000000000000003E-2,7.6999999999999999E-2,8.4000000000000005E-2,8.1000000000000003E-2,8.8000000000000009E-2,9.5000000000000001E-2,9.3000000000000013E-2,8.5000000000000006E-2,7.9000000000000001E-2,7.6999999999999999E-2,8.5000000000000006E-2,9.5000000000000001E-2,0.1,0.106,9.6999999999999989E-2,8.1000000000000003E-2,7.0000000000000007E-2,7.2000000000000008E-2,6.6000000000000003E-2,5.5E-2,5.0999999999999997E-2,4.9000000000000002E-2,4.7E-2]
[null,"Greece",null,null,null,null,null,null,null,null,null,8.199999999999999E-2,9.0999999999999998E-2,8.6999999999999994E-2,8.5000000000000006E-2,8.4000000000000005E-2,7.9000000000000001E-2,8.8000000000000009E-2,8.4000000000000005E-2,7.4999999999999997E-2,7.2000000000000008E-2,6.6000000000000003E-2,8.4000000000000005E-2,0.11199999999999999,0.159,0.223,0.254,0.248]
[null,"Hungary",null,null,null,null,null,null,null,8.4000000000000005E-2,7.6999999999999999E-2,7.4999999999999997E-2,5.7999999999999996E-2,5.4000000000000006E-2,4.8000000000000001E-2,4.8000000000000001E-2,4.9000000000000002E-2,5.2000000000000005E-2,6.0999999999999999E-2,6.5000000000000002E-2,6.5000000000000002E-2,6.9000000000000006E-2,8.8000000000000009E-2,0.1,9.9000000000000005E-2,9.6999999999999989E-2,8.900000000000001E-2,6.7000000000000004E-2]
[null,"Ireland",null,0.11699999999999999,0.126,0.13,0.13100000000000001,0.122,0.106,0.10199999999999999,8.5999999999999993E-2,6.6000000000000003E-2,4.9000000000000002E-2,3.6000000000000004E-2,3.2000000000000001E-2,3.6000000000000004E-2,3.7000000000000005E-2,3.6000000000000004E-2,3.5000000000000003E-2,3.7000000000000005E-2,3.7999999999999999E-2,5.2000000000000005E-2,0.10099999999999999,0.12,0.129,0.129,0.11599999999999999,0.1]
[null,"Italy",null,null,null,5.5E-2,6.6000000000000003E-2,7.4999999999999997E-2,8.1000000000000003E-2,8.3000000000000004E-2,8.5000000000000006E-2,8.6999999999999994E-2,8.5000000000000006E-2,7.9000000000000001E-2,7.2999999999999995E-2,6.9000000000000006E-2,6.8000000000000005E-2,6.5000000000000002E-2,6.2E-2,5.5E-2,4.9000000000000002E-2,5.5999999999999994E-2,6.4000000000000001E-2,6.9000000000000006E-2,6.9000000000000006E-2,8.900000000000001E-2,0.10199999999999999,0.106]
[null,"Latvia",null,null,null,null,null,null,null,null,null,null,0.126,0.13300000000000001,0.122,0.114,0.106,0.106,9.3000000000000013E-2,6.0999999999999999E-2,5.4000000000000006E-2,6.9000000000000006E-2,0.154,0.17399999999999999,0.14599999999999999,0.13600000000000001,0.107,0.1]
[null,"Lithuania",null,null,null,null,null,null,null,null,null,0.11900000000000001,0.129,0.14800000000000002,0.159,0.128,0.111,9.9000000000000005E-2,7.6999999999999999E-2,5.4000000000000006E-2,3.9E-2,0.05,0.122,0.161,0.13900000000000001,0.122,0.109,9.9000000000000005E-2]
[null,"Luxembourg",null,1.3000000000000001E-2,1.3999999999999999E-2,1.8000000000000002E-2,2.2000000000000002E-2,2.6000000000000002E-2,2.3E-2,2.3E-2,2.1000000000000001E-2,2.2000000000000002E-2,1.9E-2,1.8000000000000002E-2,1.4999999999999999E-2,2.1000000000000001E-2,3.2000000000000001E-2,4.0999999999999995E-2,3.7999999999999999E-2,3.7999999999999999E-2,3.3000000000000002E-2,3.9E-2,4.0999999999999995E-2,3.7999999999999999E-2,4.0999999999999995E-2,4.2000000000000003E-2,5.0999999999999997E-2,5.2000000000000005E-2]
[null,"Malta",null,null,null,null,null,null,null,null,null,null,null,4.7E-2,0.04,4.5999999999999999E-2,5.0999999999999997E-2,4.7E-2,4.7E-2,4.8000000000000001E-2,4.9000000000000002E-2,4.8000000000000001E-2,5.2999999999999999E-2,5.5999999999999994E-2,0.05,4.9000000000000002E-2,5.2000000000000005E-2,4.7E-2]
[null,"Netherlands",null,5.2999999999999999E-2,4.9000000000000002E-2,5.0999999999999997E-2,5.5999999999999994E-2,6.4000000000000001E-2,6.5000000000000002E-2,0.06,5.2999999999999999E-2,0.04,3.2000000000000001E-2,2.7999999999999997E-2,2.3E-2,2.8999999999999998E-2,3.9E-2,4.5999999999999999E-2,4.8000000000000001E-2,4.0999999999999995E-2,3.2000000000000001E-2,2.7000000000000003E-2,3.2000000000000001E-2,3.9E-2,0.04,4.7E-2,6.0999999999999999E-2,6.5000000000000002E-2]
[null,"Poland",null,null,null,null,null,null,null,null,9.3000000000000013E-2,8.5999999999999993E-2,0.111,0.13300000000000001,0.14899999999999999,0.16600000000000001,0.16399999999999998,0.161,0.152,0.11800000000000001,8.1000000000000003E-2,5.7999999999999996E-2,6.7000000000000004E-2,8.1000000000000003E-2,0.08,8.5000000000000006E-2,8.8000000000000009E-2,7.6999999999999999E-2]
[null,"Portugal",null,3.7000000000000005E-2,3.4000000000000002E-2,3.2000000000000001E-2,4.4999999999999998E-2,5.7000000000000002E-2,5.9000000000000004E-2,5.9000000000000004E-2,5.7000000000000002E-2,4.7E-2,4.2999999999999997E-2,3.9E-2,3.7999999999999999E-2,4.7E-2,5.9000000000000004E-2,6.3E-2,7.2999999999999995E-2,7.400000000000001E-2,7.8E-2,7.400000000000001E-2,9.1999999999999998E-2,0.106,0.113,0.13900000000000001,0.14699999999999999,0.125]
[null,"Romania",null,null,null,null,null,null,null,null,4.4000000000000004E-2,4.7E-2,5.5E-2,6.2E-2,5.9000000000000004E-2,6.5000000000000002E-2,6.2E-2,6.0999999999999999E-2,5.5999999999999994E-2,5.5999999999999994E-2,4.9000000000000002E-2,4.2999999999999997E-2,5.2000000000000005E-2,5.5999999999999994E-2,5.7000000000000002E-2,5.4000000000000006E-2,5.7000000000000002E-2,5.5E-2]
[null,"Slovakia",null,null,null,null,null,null,null,null,null,0.10099999999999999,0.129,0.154,0.158,0.154,0.15,0.161,0.14400000000000002,0.11699999999999999,0.10099999999999999,8.5000000000000006E-2,0.105,0.125,0.11800000000000001,0.122,0.125,0.11800000000000001]
[null,"Slovenia",null,null,null,null,null,null,null,5.0999999999999997E-2,5.2000000000000005E-2,5.7999999999999996E-2,5.7999999999999996E-2,5.4000000000000006E-2,4.8000000000000001E-2,5.0999999999999997E-2,5.5E-2,5.0999999999999997E-2,5.4000000000000006E-2,5.0999999999999997E-2,4.2000000000000003E-2,3.7000000000000005E-2,5.0999999999999997E-2,6.5000000000000002E-2,7.4999999999999997E-2,7.9000000000000001E-2,9.1999999999999998E-2,8.900000000000001E-2]
[null,"Spain",null,0.11699999999999999,0.122,0.13600000000000001,0.16600000000000001,0.17899999999999999,0.17100000000000001,0.16300000000000001,0.153,0.13699999999999998,0.114,0.10099999999999999,8.900000000000001E-2,9.8000000000000004E-2,9.9000000000000005E-2,9.5000000000000001E-2,7.6999999999999999E-2,7.2000000000000008E-2,7.0000000000000007E-2,9.6999999999999989E-2,0.157,0.17800000000000002,0.192,0.22500000000000001,0.23800000000000002,0.223]
[null,"Sweden",null,1.2E-2,2.3E-2,4.4000000000000004E-2,7.2000000000000008E-2,7.5999999999999998E-2,7.400000000000001E-2,8.199999999999999E-2,8.5999999999999993E-2,7.2000000000000008E-2,0.06,0.05,4.5999999999999999E-2,4.5999999999999999E-2,5.2000000000000005E-2,5.7000000000000002E-2,5.7000000000000002E-2,0.05,4.2999999999999997E-2,4.0999999999999995E-2,5.9000000000000004E-2,6.2E-2,5.5E-2,5.7000000000000002E-2,5.7000000000000002E-2,5.7000000000000002E-2]
[null,"United Kingdom",null,0.06,7.2999999999999995E-2,8.3000000000000004E-2,8.5999999999999993E-2,7.9000000000000001E-2,7.0999999999999994E-2,6.6000000000000003E-2,5.5E-2,4.9000000000000002E-2,4.7E-2,4.2000000000000003E-2,3.7999999999999999E-2,3.9E-2,3.6000000000000004E-2,3.3000000000000002E-2,3.3000000000000002E-2,3.7999999999999999E-2,3.6000000000000004E-2,3.9E-2,5.5999999999999994E-2,5.7999999999999996E-2,5.7999999999999996E-2,5.7000000000000002E-2,5.4000000000000006E-2,4.4000000000000004E-2]
[]
[null,"Age group less than 25"]
[]
[null,"Country",null,"1990-01-01","1991-01-01","1992-01-01","1993-01-01","1994-01-01","1995-01-01","1996-01-01","1997-01-01","1998-01-01","1999-01-01","2000-01-01","2001-01-01","2002-01-01","2003-01-01","2004-01-01","2005-01-01","2006-01-01","2007-01-01","2008-01-01","2009-01-01","2010-01-01","2011-01-01","2012-01-01","2013-01-01","2014-01-01"]
[null,"Austria",null,null,null,null,null,5.7000000000000002E-2,5.5999999999999994E-2,6.3E-2,6.7000000000000004E-2,6.4000000000000001E-2,5.4000000000000006E-2,5.2999999999999999E-2,5.7999999999999996E-2,6.7000000000000004E-2,8.1000000000000003E-2,0.105,0.11,9.8000000000000004E-2,9.4E-2,8.5000000000000006E-2,0.107,9.5000000000000001E-2,8.900000000000001E-2,9.4E-2,9.6999999999999989E-2]
[null,"Belgium",null,0.14599999999999999,0.14199999999999999,0.154,0.20699999999999999,0.23199999999999998,0.22899999999999998,0.221,0.22,0.221,0.21,0.16699999999999998,0.16800000000000001,0.17699999999999999,0.218,0.21199999999999999,0.215,0.20499999999999999,0.188,0.18,0.21899999999999997,0.22399999999999998,0.187,0.19800000000000001,0.23699999999999999,0.23199999999999998]
[null,"Bulgaria",null,null,null,null,null,null,null,null,null,null,null,0.33700000000000002,0.38299999999999995,0.35200000000000004,0.26600000000000001,0.24299999999999999,0.21,0.183,0.14099999999999999,0.11900000000000001,0.151,0.218,0.25,0.28100000000000003,0.28399999999999997,0.23600000000000002]
[null,"Croatia",null,null,null,null,null,null,null,null,null,null,null,0.37,0.40100000000000002,0.35499999999999998,0.34700000000000003,0.32799999999999996,0.31900000000000001,0.28800000000000003,0.252,0.23699999999999999,0.252,0.32400000000000001,0.36700000000000005,0.42100000000000004,0.5,0.45]
[null,"Cyprus",null,null,null,null,null,null,null,null,null,null,null,9.9000000000000005E-2,8.199999999999999E-2,0.08,8.8000000000000009E-2,0.10199999999999999,0.13900000000000001,0.1,0.10199999999999999,0.09,0.13800000000000001,0.16600000000000001,0.22399999999999998,0.27699999999999997,0.38900000000000001,0.35499999999999998]
[null,"Czech Republic",null,null,null,null,8.4000000000000005E-2,8.6999999999999994E-2,7.8E-2,7.2000000000000008E-2,8.5999999999999993E-2,0.124,0.17,0.17,0.16600000000000001,0.16,0.17600000000000002,0.20399999999999999,0.193,0.17499999999999999,0.107,9.9000000000000005E-2,0.16600000000000001,0.183,0.18100000000000002,0.19500000000000001,0.18899999999999997,0.159]
[null,"Denmark",null,0.105,0.107,0.11699999999999999,0.128,0.10199999999999999,9.6000000000000002E-2,9.6999999999999989E-2,7.6999999999999999E-2,7.2999999999999995E-2,9.0999999999999998E-2,6.2E-2,8.3000000000000004E-2,7.400000000000001E-2,9.1999999999999998E-2,8.199999999999999E-2,8.5999999999999993E-2,7.6999999999999999E-2,7.4999999999999997E-2,0.08,0.11800000000000001,0.13900000000000001,0.14199999999999999,0.14099999999999999,0.13,0.126]
[null,"Estonia",null,null,null,null,null,null,null,null,null,null,null,0.23899999999999999,0.222,0.17899999999999999,0.20899999999999999,0.23899999999999999,0.151,0.121,0.10099999999999999,0.12,0.27399999999999997,0.32899999999999996,0.22399999999999998,0.20899999999999999,0.187,0.15]
[null,"Finland",null,9.3000000000000013E-2,0.16300000000000001,0.26400000000000001,0.33600000000000002,0.34,0.29699999999999999,0.28000000000000003,0.252,0.23499999999999999,0.214,0.214,0.19800000000000001,0.21,0.218,0.20699999999999999,0.20100000000000001,0.187,0.16500000000000001,0.16500000000000001,0.215,0.214,0.20100000000000001,0.19,0.19899999999999998,0.20499999999999999]
[null,"France",null,0.214,0.23600000000000002,0.27600000000000002,0.33,0.35399999999999998,0.34700000000000003,0.37200000000000005,0.39299999999999996,0.37799999999999995,0.373,0.315,0.29100000000000004,0.30499999999999999,0.18899999999999997,0.20499999999999999,0.21,0.22,0.19500000000000001,0.19,0.23600000000000002,0.23300000000000001,0.22600000000000001,0.24399999999999999,0.248,0.24299999999999999]
[null,"Germany",null,null,5.7999999999999996E-2,6.5000000000000002E-2,0.08,8.900000000000001E-2,8.900000000000001E-2,0.1,0.106,9.6999999999999989E-2,0.09,8.6999999999999994E-2,8.3000000000000004E-2,9.8000000000000004E-2,0.115,0.13699999999999998,0.154,0.13600000000000001,0.11800000000000001,0.10400000000000001,0.111,9.8000000000000004E-2,8.5000000000000006E-2,0.08,7.8E-2,7.6999999999999999E-2]
[null,"Greece",null,null,null,null,null,null,null,null,null,0.30399999999999999,0.315,0.29100000000000004,0.28000000000000003,0.26800000000000002,0.26800000000000002,0.26500000000000001,0.25800000000000001,0.25,0.22699999999999998,0.21899999999999997,0.25700000000000001,0.33,0.44700000000000001,0.55299999999999994,0.58299999999999996,0.52300000000000002]
[null,"Hungary",null,null,null,null,null,null,null,0.19699999999999998,0.17199999999999999,0.153,0.125,0.11900000000000001,0.11,0.11900000000000001,0.13200000000000001,0.155,0.19399999999999998,0.191,0.18100000000000002,0.19500000000000001,0.26400000000000001,0.26400000000000001,0.26,0.28199999999999997,0.26600000000000001,0.20399999999999999]
[null,"Ireland",null,0.19399999999999998,0.22399999999999998,0.24399999999999999,0.253,0.23,0.19500000000000001,0.182,0.154,0.113,8.5000000000000006E-2,6.7000000000000004E-2,7.2000000000000008E-2,8.4000000000000005E-2,8.6999999999999994E-2,8.6999999999999994E-2,8.5999999999999993E-2,8.6999999999999994E-2,9.0999999999999998E-2,0.13300000000000001,0.24,0.27600000000000002,0.29100000000000004,0.30399999999999999,0.26800000000000002,0.24]
[null,"Italy",null,null,null,0.26400000000000001,0.27100000000000002,0.28699999999999998,0.29899999999999999,0.29899999999999999,0.29600000000000004,0.29199999999999998,0.28000000000000003,0.26200000000000001,0.23100000000000001,0.22,0.23600000000000002,0.23499999999999999,0.24100000000000002,0.218,0.20399999999999999,0.21199999999999999,0.253,0.27899999999999997,0.29199999999999998,0.35299999999999998,0.4,0.42700000000000005]
[null,"Latvia",null,null,null,null,null,null,null,null,null,null,0.24,0.22399999999999998,0.22699999999999998,0.20300000000000001,0.19600000000000001,0.2,0.151,0.13600000000000001,0.106,0.13600000000000001,0.33299999999999996,0.36200000000000004,0.31,0.28499999999999998,0.23199999999999998,0.19600000000000001]
[null,"Lithuania",null,null,null,null,null,null,null,null,null,0.22899999999999998,0.27200000000000002,0.3,0.311,0.23,0.248,0.218,0.158,0.1,8.4000000000000005E-2,0.13300000000000001,0.29600000000000004,0.35700000000000004,0.32600000000000001,0.26700000000000002,0.21899999999999997,0.193]
[null,"Luxembourg",null,3.7999999999999999E-2,3.1E-2,3.7999999999999999E-2,5.2000000000000005E-2,7.0999999999999994E-2,7.2000000000000008E-2,8.199999999999999E-2,7.9000000000000001E-2,6.9000000000000006E-2,6.9000000000000006E-2,6.6000000000000003E-2,6.2E-2,7.0000000000000007E-2,0.11199999999999999,0.16399999999999998,0.14599999999999999,0.155,0.156,0.17300000000000001,0.16500000000000001,0.158,0.16399999999999998,0.18,0.16899999999999998,0.18899999999999997]
[null,"Malta",null,null,null,null,null,null,null,null,null,null,null,0.13699999999999998,0.188,0.17100000000000001,0.17399999999999999,0.16600000000000001,0.161,0.155,0.13500000000000001,0.11699999999999999,0.14499999999999999,0.13200000000000001,0.13300000000000001,0.14099999999999999,0.13,0.127]
[null,"Netherlands",null,9.0999999999999998E-2,8.8000000000000009E-2,8.5000000000000006E-2,0.10400000000000001,0.111,0.16800000000000001,0.157,0.124,0.109,9.4E-2,8.199999999999999E-2,6.7000000000000004E-2,7.400000000000001E-2,9.9000000000000005E-2,0.114,0.11800000000000001,0.1,9.4E-2,8.5999999999999993E-2,0.10199999999999999,0.111,0.1,0.11699999999999999,0.13200000000000001,0.127]
[null,"Poland",null,null,null,null,null,null,null,null,0.23199999999999998,0.22500000000000001,0.30099999999999999,0.35100000000000003,0.39500000000000002,0.42499999999999999,0.41899999999999998,0.39600000000000002,0.36899999999999999,0.29799999999999999,0.21600000000000003,0.17199999999999999,0.20600000000000002,0.23699999999999999,0.25800000000000001,0.26500000000000001,0.27300000000000002,0.23899999999999999]
[null,"Portugal",null,0.129,0.11900000000000001,0.125,0.15,0.16899999999999998,0.183,0.187,0.17199999999999999,0.14099999999999999,0.127,0.126,0.13300000000000001,0.156,0.18600000000000003,0.19800000000000001,0.20699999999999999,0.21100000000000002,0.215,0.215,0.253,0.27899999999999997,0.30299999999999999,0.379,0.38100000000000001,0.34799999999999998]
[null,"Romania",null,null,null,null,null,null,null,null,0.158,0.154,0.16500000000000001,0.16500000000000001,0.17,0.19800000000000001,0.185,0.20499999999999999,0.191,0.20199999999999999,0.193,0.17600000000000002,0.2,0.221,0.23899999999999999,0.22600000000000001,0.23699999999999999,0.24]
[null,"Slovakia",null,null,null,null,null,null,null,null,null,0.255,0.34200000000000003,0.373,0.39600000000000002,0.38100000000000001,0.33799999999999997,0.33399999999999996,0.30399999999999999,0.27,0.20600000000000002,0.193,0.27600000000000002,0.33899999999999997,0.33700000000000002,0.34,0.33700000000000002,0.30399999999999999]
[null,"Slovenia",null,null,null,null,null,null,null,0.17499999999999999,0.17199999999999999,0.17800000000000002,0.17600000000000002,0.16300000000000001,0.17800000000000002,0.16500000000000001,0.17300000000000001,0.161,0.159,0.13900000000000001,0.10099999999999999,0.10400000000000001,0.13600000000000001,0.14699999999999999,0.157,0.20600000000000002,0.21600000000000003,0.217]
[null,"Spain",null,0.30499999999999999,0.29199999999999998,0.32299999999999995,0.40700000000000003,0.42299999999999999,0.39799999999999996,0.39200000000000002,0.36099999999999999,0.32400000000000001,0.26400000000000001,0.23199999999999998,0.21100000000000002,0.222,0.22699999999999998,0.22,0.19600000000000001,0.17899999999999999,0.18100000000000002,0.245,0.377,0.41499999999999998,0.46200000000000002,0.52900000000000003,0.55500000000000005,0.53200000000000003]
[null,"Sweden",null,4.4000000000000004E-2,7.5999999999999998E-2,0.13200000000000001,0.22,0.22,0.191,0.20499999999999999,0.20600000000000002,0.161,0.12300000000000001,0.105,0.15,0.16399999999999998,0.17399999999999999,0.20399999999999999,0.22600000000000001,0.215,0.192,0.20199999999999999,0.25,0.248,0.22800000000000001,0.23699999999999999,0.23600000000000002,0.22899999999999998]
[null,"United Kingdom",null,0.10400000000000001,0.13900000000000001,0.16300000000000001,0.17499999999999999,0.16399999999999998,0.153,0.14899999999999999,0.13699999999999998,0.13100000000000001,0.127,0.122,0.11699999999999999,0.12,0.122,0.12,0.128,0.13900000000000001,0.14300000000000002,0.15,0.191,0.19899999999999998,0.21299999999999999,0.21199999999999999,0.20699999999999999,0.16899999999999998]

{"sheet":"control","index":2,"n_rows":82,"n_cols":28,"rows_kept":82,"cut":false,"hidden":false,"merged":[]}
[]
[null,"Control"]
[]
[null,"Selection age group",1]
[null,"Age group","25 to 74"]
[null,null,"Less than 25"]
[]
[null,"Selection country",11]
[]
[null,"Selection year",20]
[null,"Years",{"$f":"calcs!$D$6","v":"1990-01-01"}]
[null,null,{"$f":"calcs!$E$6","v":"1991-01-01"}]
[null,null,{"$f":"calcs!$F$6","v":"1992-01-01"}]
[null,null,{"$f":"calcs!$G$6","v":"1993-01-01"}]
[null,null,{"$f":"calcs!$H$6","v":"1994-01-01"}]
[null,null,{"$f":"calcs!$I$6","v":"1995-01-01"}]
[null,null,{"$f":"calcs!$J$6","v":"1996-01-01"}]
[null,null,{"$f":"calcs!$K$6","v":"1997-01-01"}]
[null,null,{"$f":"calcs!$L$6","v":"1998-01-01"}]
[null,null,{"$f":"calcs!$M$6","v":"1999-01-01"}]
[null,null,{"$f":"calcs!$N$6","v":"2000-01-01"}]
[null,null,{"$f":"calcs!$O$6","v":"2001-01-01"}]
[null,null,{"$f":"calcs!$P$6","v":"2002-01-01"}]
[null,null,{"$f":"calcs!$Q$6","v":"2003-01-01"}]
[null,null,{"$f":"calcs!$R$6","v":"2004-01-01"}]
[null,null,{"$f":"calcs!$S$6","v":"2005-01-01"}]
[null,null,{"$f":"calcs!$T$6","v":"2006-01-01"}]
[null,null,{"$f":"calcs!$U$6","v":"2007-01-01"}]
[null,null,{"$f":"calcs!$V$6","v":"2008-01-01"}]
[null,null,{"$f":"calcs!$W$6","v":"2009-01-01"}]
[null,null,{"$f":"calcs!$X$6","v":"2010-01-01"}]
[null,null,{"$f":"calcs!$Y$6","v":"2011-01-01"}]
[null,null,{"$f":"calcs!$Z$6","v":"2012-01-01"}]
[null,null,{"$f":"calcs!$AA$6","v":"2013-01-01"}]
[null,null,{"$f":"calcs!$AB$6","v":"2014-01-01"}]
[]
[null,"Selected chart",1]
[]
[null,"Horizontal Offset",15]
[null,"Vertical Offset",6]
[]
[null,"Selected color scale",1]
[]
[null,"Color Scales",null,null,"Select a color scheme"]
[]
[null,null,"Threshold","RGB","Legend",1,{"$f":"F46+1","v":2},{"$f":"G46+1","v":3},4,5,6,7,8,9,10,11,12,13,14,15,16,17,18,19,20,21,22,23]
[null,null,null,8421504,"no data"]
[null,null,{"$f":"calcs!F173","v":0.02},3631104,{"$f":"calcs!G173","v":"0% to 2%"}]
[null,null,{"$f":"calcs!F174","v":0.04},5281818,{"$f":"calcs!G174","v":"2% to 4%"}]
[null,null,{"$f":"calcs!F175","v":0.06},6536550,{"$f":"calcs!G175","v":"4% to 6%"}]
[null,null,{"$f":"calcs!F176","v":0.08},7002534,{"$f":"calcs!G176","v":"6% to 8%"}]
[null,null,{"$f":"calcs!F177","v":0.1},9170905,{"$f":"calcs!G177","v":"8% to 10%"}]
[null,null,{"$f":"calcs!F178","v":0.12000000000000001},9167102,{"$f":"calcs!G178","v":"10% to 12%"}]
[null,null,{"$f":"calcs!F179","v":0.14000000000000001},6401789,{"$f":"calcs!G179","v":"12% to 14%"}]
[null,null,{"$f":"calcs!F180","v":0.16},4419060,{"$f":"calcs!G180","v":"14% to 16%"}]
[null,null,{"$f":"calcs!F181","v":1},2568407,{"$f":"calcs!G181","v":"16% or more"}]
[]
[null,"Color Scales",1,"Green Yellow Red"]
[null,null,2,"Green to Pink"]
[null,null,3,"Green to Purple"]
[null,null,4,"Green to Brown"]
[null,null,5,"Blue to Red"]
[null,null,6,"Blue to Red Brown"]
[null,null,7,"Brown to Purple"]
[null,null,8,"Brown Blue Green"]
[null,null,9,"Purple to Green"]
[null,null,10,"Pink to Green"]
[null,null,11,"Red to Blue"]
[null,null,12,"Red to Black"]
[null,null,13,"Red Yellow Blue"]
[null,null,14,"Spectral"]
[null,null,15,"Red Yellow Green"]
[null,null,16,"Light"]
[null,null,17,"Pairwise"]
[null,null,18,"Light to Dark Blue"]
[null,null,19,"Light to Dark Red"]
[null,null,20,"Light to Dark Brown"]
[null,null,21,"Light to Dark Green"]
[null,null,22,"Light to Dark Yellow"]
[null,null,23,"Light Grey to Black"]
[]
[null,null,null,null,"Recreate the shape index after you inserted a new map or added new shapes"]

{"sheet":"calcs","index":3,"n_rows":181,"n_cols":28,"rows_kept":181,"cut":false,"hidden":false,"merged":[]}
[]
[null,"Calculations"]
[]
[null,"Age group data"]
[]
[null,null,"Country",{"$f":"data!D6","v":"1990-01-01"},{"$f":"data!E6","v":"1991-01-01"},{"$f":"data!F6","v":"1992-01-01"},{"$f":"data!G6","v":"1993-01-01"},{"$f":"data!H6","v":"1994-01-01"},{"$f":"data!I6","v":"1995-01-01"},{"$f":"data!J6","v":"1996-01-01"},{"$f":"data!K6","v":"1997-01-01"},{"$f":"data!L6","v":"1998-01-01"},{"$f":"data!M6","v":"1999-01-01"},{"$f":"data!N6","v":"2000-01-01"},{"$f":"data!O6","v":"2001-01-01"},{"$f":"data!P6","v":"2002-01-01"},{"$f":"data!Q6","v":"2003-01-01"},{"$f":"data!R6","v":"2004-01-01"},{"$f":"data!S6","v":"2005-01-01"},{"$f":"data!T6","v":"2006-01-01"},{"$f":"data!U6","v":"2007-01-01"},{"$f":"data!V6","v":"2008-01-01"},{"$f":"data!W6","v":"2009-01-01"},{"$f":"data!X6","v":"2010-01-01"},{"$f":"data!Y6","v":"2011-01-01"},{"$f":"data!Z6","v":"2012-01-01"},{"$f":"data!AA6","v":"2013-01-01"},{"$f":"data!AB6","v":"2014-01-01"}]
[null,null,{"$f":"data!B7","v":"Austria"},{"$f":"IF(ISBLANK(CHOOSE(control!$C$4,data!D7,data!D39)),\"\",CHOOSE(control!$C$4,data!D7,data!D39))","v":""},{"$f":"IF(ISBLANK(CHOOSE(control!$C$4,data!E7,data!E39)),\"\",CHOOSE(control!$C$4,data!E7,data!E39))","v":""},{"$f":"IF(ISBLANK(CHOOSE(control!$C$4,data!F7,data!F39)),\"\",CHOOSE(control!$C$4,data!F7,data!F39))","v":""},{"$f":"IF(ISBLANK(CHOOSE(control!$C$4,data!G7,data!G39)),\"\",CHOOSE(control!$C$4,data!G7,data!G39))","v":""},{"$f":"IF(ISBLANK(CHOOSE(control!$C$4,data!H7,data!H39)),\"\",CHOOSE(control!$C$4,data!H7,data!H39))","v":3.5000000000000003E-2},{"$f":"IF(ISBLANK(CHOOSE(control!$C$4,data!I7,data!I39)),\"\",CHOOSE(control!$C$4,data!I7,data!I39))","v":3.6000000000000004E-2},{"$f":"IF(ISBLANK(CHOOSE(control!$C$4,data!J7,data!J39)),\"\",CHOOSE(control!$C$4,data!J7,data!J39))","v":0.04},{"$f":"IF(ISBLANK(CHOOSE(control!$C$4,data!K7,data!K39)),\"\",CHOOSE(control!$C$4,data!K7,data!K39))","v":0.04},{"$f":"IF(ISBLANK(CHOOSE(control!$C$4,data!L7,data!L39)),\"\",CHOOSE(control!$C$4,data!L7,data!L39))","v":4.2000000000000003E-2},{"$f":"IF(ISBLANK(CHOOSE(control!$C$4,data!M7,data!M39)),\"\",CHOOSE(control!$C$4,data!M7,data!M39))","v":3.7000000000000005E-2},{"$f":"IF(ISBLANK(CHOOSE(control!$C$4,data!N7,data!N39)),\"\",CHOOSE(control!$C$4,data!N7,data!N39))","v":3.4000000000000002E-2},{"$f":"IF(ISBLANK(CHOOSE(control!$C$4,data!O7,data!O39)),\"\",CHOOSE(control!$C$4,data!O7,data!O39))","v":3.3000000000000002E-2},{"$f":"IF(ISBLANK(CHOOSE(control!$C$4,data!P7,data!P39)),\"\",CHOOSE(control!$C$4,data!P7,data!P39))","v":3.7999999999999999E-2},{"$f":"IF(ISBLANK(CHOOSE(control!$C$4,data!Q7,data!Q39)),\"\",CHOOSE(control!$C$4,data!Q7,data!Q39))","v":3.7000000000000005E-2},{"$f":"IF(ISBLANK(CHOOSE(control!$C$4,data!R7,data!R39)),\"\",CHOOSE(control!$C$4,data!R7,data!R39))","v":4.7E-2},{"$f":"IF(ISBLANK(CHOOSE(control!$C$4,data!S7,data!S39)),\"\",CHOOSE(control!$C$4,data!S7,data!S39))","v":4.7E-2},{"$f":"IF(ISBLANK(CHOOSE(control!$C$4,data!T7,data!T39)),\"\",CHOOSE(control!$C$4,data!T7,data!T39))","v":4.4999999999999998E-2},{"$f":"IF(ISBLANK(CHOOSE(control!$C$4,data!U7,data!U39)),\"\",CHOOSE(control!$C$4,data!U7,data!U39))","v":4.0999999999999995E-2},{"$f":"IF(ISBLANK(CHOOSE(control!$C$4,data!V7,data!V39)),\"\",CHOOSE(control!$C$4,data!V7,data!V39))","v":3.4000000000000002E-2},{"$f":"IF(ISBLANK(CHOOSE(control!$C$4,data!W7,data!W39)),\"\",CHOOSE(control!$C$4,data!W7,data!W39))","v":4.4000000000000004E-2},{"$f":"IF(ISBLANK(CHOOSE(control!$C$4,data!X7,data!X39)),\"\",CHOOSE(control!$C$4,data!X7,data!X39))","v":4.0999999999999995E-2},{"$f":"IF(ISBLANK(CHOOSE(control!$C$4,data!Y7,data!Y39)),\"\",CHOOSE(control!$C$4,data!Y7,data!Y39))","v":3.9E-2},{"$f":"IF(ISBLANK(CHOOSE(control!$C$4,data!Z7,data!Z39)),\"\",CHOOSE(control!$C$4,data!Z7,data!Z39))","v":4.2000000000000003E-2},{"$f":"IF(ISBLANK(CHOOSE(control!$C$4,data!AA7,data!AA39)),\"\",CHOOSE(control!$C$4,data!AA7,data!AA39))","v":4.7E-2},{"$f":"IF(ISBLANK(CHOOSE(control!$C$4,data!AB7,data!AB39)),\"\",CHOOSE(control!$C$4,data!AB7,data!AB39))","v":""}]
[null,null,{"$f":"data!B8","v":"Belgium"},{"$f":"IF(ISBLANK(CHOOSE(control!$C$4,data!D8,data!D40)),\"\",CHOOSE(control!$C$4,data!D8,data!D40))","v":5.4000000000000006E-2},{"$f":"IF(ISBLANK(CHOOSE(control!$C$4,data!E8,data!E40)),\"\",CHOOSE(control!$C$4,data!E8,data!E40))","v":5.4000000000000006E-2},{"$f":"IF(ISBLANK(CHOOSE(control!$C$4,data!F8,data!F40)),\"\",CHOOSE(control!$C$4,data!F8,data!F40))","v":0.06},{"$f":"IF(ISBLANK(CHOOSE(control!$C$4,data!G8,data!G40)),\"\",CHOOSE(control!$C$4,data!G8,data!G40))","v":7.0999999999999994E-2},{"$f":"IF(ISBLANK(CHOOSE(control!$C$4,data!H8,data!H40)),\"\",CHOOSE(control!$C$4,data!H8,data!H40))","v":8.1000000000000003E-2},{"$f":"IF(ISBLANK(CHOOSE(control!$C$4,data!I8,data!I40)),\"\",CHOOSE(control!$C$4,data!I8,data!I40))","v":8.1000000000000003E-2},{"$f":"IF(ISBLANK(CHOOSE(control!$C$4,data!J8,data!J40)),\"\",CHOOSE(control!$C$4,data!J8,data!J40))","v":8.1000000000000003E-2},{"$f":"IF(ISBLANK(CHOOSE(control!$C$4,data!K8,data!K40)),\"\",CHOOSE(control!$C$4,data!K8,data!K40))","v":7.8E-2},{"$f":"IF(ISBLANK(CHOOSE(control!$C$4,data!L8,data!L40)),\"\",CHOOSE(control!$C$4,data!L8,data!L40))","v":0.08},{"$f":"IF(ISBLANK(CHOOSE(control!$C$4,data!M8,data!M40)),\"\",CHOOSE(control!$C$4,data!M8,data!M40))","v":7.0999999999999994E-2},{"$f":"IF(ISBLANK(CHOOSE(control!$C$4,data!N8,data!N40)),\"\",CHOOSE(control!$C$4,data!N8,data!N40))","v":5.7999999999999996E-2},{"$f":"IF(ISBLANK(CHOOSE(control!$C$4,data!O8,data!O40)),\"\",CHOOSE(control!$C$4,data!O8,data!O40))","v":5.4000000000000006E-2},{"$f":"IF(ISBLANK(CHOOSE(control!$C$4,data!P8,data!P40)),\"\",CHOOSE(control!$C$4,data!P8,data!P40))","v":6.4000000000000001E-2},{"$f":"IF(ISBLANK(CHOOSE(control!$C$4,data!Q8,data!Q40)),\"\",CHOOSE(control!$C$4,data!Q8,data!Q40))","v":6.7000000000000004E-2},{"$f":"IF(ISBLANK(CHOOSE(control!$C$4,data!R8,data!R40)),\"\",CHOOSE(control!$C$4,data!R8,data!R40))","v":7.0000000000000007E-2},{"$f":"IF(ISBLANK(CHOOSE(control!$C$4,data!S8,data!S40)),\"\",CHOOSE(control!$C$4,data!S8,data!S40))","v":7.0999999999999994E-2},{"$f":"IF(ISBLANK(CHOOSE(control!$C$4,data!T8,data!T40)),\"\",CHOOSE(control!$C$4,data!T8,data!T40))","v":7.0000000000000007E-2},{"$f":"IF(ISBLANK(CHOOSE(control!$C$4,data!U8,data!U40)),\"\",CHOOSE(control!$C$4,data!U8,data!U40))","v":6.3E-2},{"$f":"IF(ISBLANK(CHOOSE(control!$C$4,data!V8,data!V40)),\"\",CHOOSE(control!$C$4,data!V8,data!V40))","v":5.9000000000000004E-2},{"$f":"IF(ISBLANK(CHOOSE(control!$C$4,data!W8,data!W40)),\"\",CHOOSE(control!$C$4,data!W8,data!W40))","v":6.6000000000000003E-2},{"$f":"IF(ISBLANK(CHOOSE(control!$C$4,data!X8,data!X40)),\"\",CHOOSE(control!$C$4,data!X8,data!X40))","v":7.0000000000000007E-2},{"$f":"IF(ISBLANK(CHOOSE(control!$C$4,data!Y8,data!Y40)),\"\",CHOOSE(control!$C$4,data!Y8,data!Y40))","v":0.06},{"$f":"IF(ISBLANK(CHOOSE(control!$C$4,data!Z8,data!Z40)),\"\",CHOOSE(control!$C$4,data!Z8,data!Z40))","v":6.4000000000000001E-2},{"$f":"IF(ISBLANK(CHOOSE(control!$C$4,data!AA8,data!AA40)),\"\",CHOOSE(control!$C$4,data!AA8,data!AA40))","v":7.0999999999999994E-2},{"$f":"IF(ISBLANK(CHOOSE(control!$C$4,data!AB8,data!AB40)),\"\",CHOOSE(control!$C$4,data!AB8,data!AB40))","v":7.2999999999999995E-2}]
[null,null,{"$f":"data!B9","v":"Bulgaria"},{"$f":"IF(ISBLANK(CHOOSE(control!$C$4,data!D9,data!D41)),\"\",CHOOSE(control!$C$4,data!D9,data!D41))","v":""},{"$f":"IF(ISBLANK(CHOOSE(control!$C$4,data!E9,data!E41)),\"\",CHOOSE(control!$C$4,data!E9,data!E41))","v":""},{"$f":"IF(ISBLANK(CHOOSE(control!$C$4,data!F9,data!F41)),\"\",CHOOSE(control!$C$4,data!F9,data!F41))","v":""},{"$f":"IF(ISBLANK(CHOOSE(control!$C$4,data!G9,data!G41)),\"\",CHOOSE(control!$C$4,data!G9,data!G41))","v":""},{"$f":"IF(ISBLANK(CHOOSE(control!$C$4,data!H9,data!H41)),\"\",CHOOSE(control!$C$4,data!H9,data!H41))","v":""},{"$f":"IF(ISBLANK(CHOOSE(control!$C$4,data!I9,data!I41)),\"\",CHOOSE(control!$C$4,data!I9,data!I41))","v":""},{"$f":"IF(ISBLANK(CHOOSE(control!$C$4,data!J9,data!J41)),\"\",CHOOSE(control!$C$4,data!J9,data!J41))","v":""},{"$f":"IF(ISBLANK(CHOOSE(control!$C$4,data!K9,data!K41)),\"\",CHOOSE(control!$C$4,data!K9,data!K41))","v":""},{"$f":"IF(ISBLANK(CHOOSE(control!$C$4,data!L9,data!L41)),\"\",CHOOSE(control!$C$4,data!L9,data!L41))","v":""},{"$f":"IF(ISBLANK(CHOOSE(control!$C$4,data!M9,data!M41)),\"\",CHOOSE(control!$C$4,data!M9,data!M41))","v":""},{"$f":"IF(ISBLANK(CHOOSE(control!$C$4,data!N9,data!N41)),\"\",CHOOSE(control!$C$4,data!N9,data!N41))","v":0.14499999999999999},{"$f":"IF(ISBLANK(CHOOSE(control!$C$4,data!O9,data!O41)),\"\",CHOOSE(control!$C$4,data!O9,data!O41))","v":0.17199999999999999},{"$f":"IF(ISBLANK(CHOOSE(control!$C$4,data!P9,data!P41)),\"\",CHOOSE(control!$C$4,data!P9,data!P41))","v":0.16200000000000001},{"$f":"IF(ISBLANK(CHOOSE(control!$C$4,data!Q9,data!Q41)),\"\",CHOOSE(control!$C$4,data!Q9,data!Q41))","v":0.124},{"$f":"IF(ISBLANK(CHOOSE(control!$C$4,data!R9,data!R41)),\"\",CHOOSE(control!$C$4,data!R9,data!R41))","v":0.10800000000000001},{"$f":"IF(ISBLANK(CHOOSE(control!$C$4,data!S9,data!S41)),\"\",CHOOSE(control!$C$4,data!S9,data!S41))","v":0.09},{"$f":"IF(ISBLANK(CHOOSE(control!$C$4,data!T9,data!T41)),\"\",CHOOSE(control!$C$4,data!T9,data!T41))","v":8.1000000000000003E-2},{"$f":"IF(ISBLANK(CHOOSE(control!$C$4,data!U9,data!U41)),\"\",CHOOSE(control!$C$4,data!U9,data!U41))","v":6.2E-2},{"$f":"IF(ISBLANK(CHOOSE(control!$C$4,data!V9,data!V41)),\"\",CHOOSE(control!$C$4,data!V9,data!V41))","v":0.05},{"$f":"IF(ISBLANK(CHOOSE(control!$C$4,data!W9,data!W41)),\"\",CHOOSE(control!$C$4,data!W9,data!W41))","v":6.0999999999999999E-2},{"$f":"IF(ISBLANK(CHOOSE(control!$C$4,data!X9,data!X41)),\"\",CHOOSE(control!$C$4,data!X9,data!X41))","v":9.3000000000000013E-2},{"$f":"IF(ISBLANK(CHOOSE(control!$C$4,data!Y9,data!Y41)),\"\",CHOOSE(control!$C$4,data!Y9,data!Y41))","v":0.10099999999999999},{"$f":"IF(ISBLANK(CHOOSE(control!$C$4,data!Z9,data!Z41)),\"\",CHOOSE(control!$C$4,data!Z9,data!Z41))","v":0.11},{"$f":"IF(ISBLANK(CHOOSE(control!$C$4,data!AA9,data!AA41)),\"\",CHOOSE(control!$C$4,data!AA9,data!AA41))","v":0.11800000000000001},{"$f":"IF(ISBLANK(CHOOSE(control!$C$4,data!AB9,data!AB41)),\"\",CHOOSE(control!$C$4,data!AB9,data!AB41))","v":0.10800000000000001}]
[null,null,{"$f":"data!B10","v":"Croatia"},{"$f":"IF(ISBLANK(CHOOSE(control!$C$4,data!D10,data!D42)),\"\",CHOOSE(control!$C$4,data!D10,data!D42))","v":""},{"$f":"IF(ISBLANK(CHOOSE(control!$C$4,data!E10,data!E42)),\"\",CHOOSE(control!$C$4,data!E10,data!E42))","v":""},{"$f":"IF(ISBLANK(CHOOSE(control!$C$4,data!F10,data!F42)),\"\",CHOOSE(control!$C$4,data!F10,data!F42))","v":""},{"$f":"IF(ISBLANK(CHOOSE(control!$C$4,data!G10,data!G42)),\"\",CHOOSE(control!$C$4,data!G10,data!G42))","v":""},{"$f":"IF(ISBLANK(CHOOSE(control!$C$4,data!H10,data!H42)),\"\",CHOOSE(control!$C$4,data!H10,data!H42))","v":""},{"$f":"IF(ISBLANK(CHOOSE(control!$C$4,data!I10,data!I42)),\"\",CHOOSE(control!$C$4,data!I10,data!I42))","v":""},{"$f":"IF(ISBLANK(CHOOSE(control!$C$4,data!J10,data!J42)),\"\",CHOOSE(control!$C$4,data!J10,data!J42))","v":""},{"$f":"IF(ISBLANK(CHOOSE(control!$C$4,data!K10,data!K42)),\"\",CHOOSE(control!$C$4,data!K10,data!K42))","v":""},{"$f":"IF(ISBLANK(CHOOSE(control!$C$4,data!L10,data!L42)),\"\",CHOOSE(control!$C$4,data!L10,data!L42))","v":""},{"$f":"IF(ISBLANK(CHOOSE(control!$C$4,data!M10,data!M42)),\"\",CHOOSE(control!$C$4,data!M10,data!M42))","v":""},{"$f":"IF(ISBLANK(CHOOSE(control!$C$4,data!N10,data!N42)),\"\",CHOOSE(control!$C$4,data!N10,data!N42))","v":0.125},{"$f":"IF(ISBLANK(CHOOSE(control!$C$4,data!O10,data!O42)),\"\",CHOOSE(control!$C$4,data!O10,data!O42))","v":0.121},{"$f":"IF(ISBLANK(CHOOSE(control!$C$4,data!P10,data!P42)),\"\",CHOOSE(control!$C$4,data!P10,data!P42))","v":0.121},{"$f":"IF(ISBLANK(CHOOSE(control!$C$4,data!Q10,data!Q42)),\"\",CHOOSE(control!$C$4,data!Q10,data!Q42))","v":0.113},{"$f":"IF(ISBLANK(CHOOSE(control!$C$4,data!R10,data!R42)),\"\",CHOOSE(control!$C$4,data!R10,data!R42))","v":0.114},{"$f":"IF(ISBLANK(CHOOSE(control!$C$4,data!S10,data!S42)),\"\",CHOOSE(control!$C$4,data!S10,data!S42))","v":0.105},{"$f":"IF(ISBLANK(CHOOSE(control!$C$4,data!T10,data!T42)),\"\",CHOOSE(control!$C$4,data!T10,data!T42))","v":9.6000000000000002E-2},{"$f":"IF(ISBLANK(CHOOSE(control!$C$4,data!U10,data!U42)),\"\",CHOOSE(control!$C$4,data!U10,data!U42))","v":8.199999999999999E-2},{"$f":"IF(ISBLANK(CHOOSE(control!$C$4,data!V10,data!V42)),\"\",CHOOSE(control!$C$4,data!V10,data!V42))","v":6.9000000000000006E-2},{"$f":"IF(ISBLANK(CHOOSE(control!$C$4,data!W10,data!W42)),\"\",CHOOSE(control!$C$4,data!W10,data!W42))","v":7.4999999999999997E-2},{"$f":"IF(ISBLANK(CHOOSE(control!$C$4,data!X10,data!X42)),\"\",CHOOSE(control!$C$4,data!X10,data!X42))","v":9.5000000000000001E-2},{"$f":"IF(ISBLANK(CHOOSE(control!$C$4,data!Y10,data!Y42)),\"\",CHOOSE(control!$C$4,data!Y10,data!Y42))","v":0.11599999999999999},{"$f":"IF(ISBLANK(CHOOSE(control!$C$4,data!Z10,data!Z42)),\"\",CHOOSE(control!$C$4,data!Z10,data!Z42))","v":0.13699999999999998},{"$f":"IF(ISBLANK(CHOOSE(control!$C$4,data!AA10,data!AA42)),\"\",CHOOSE(control!$C$4,data!AA10,data!AA42))","v":0.14400000000000002},{"$f":"IF(ISBLANK(CHOOSE(control!$C$4,data!AB10,data!AB42)),\"\",CHOOSE(control!$C$4,data!AB10,data!AB42))","v":0.14300000000000002}]
[null,null,{"$f":"data!B11","v":"Cyprus"},{"$f":"IF(ISBLANK(CHOOSE(control!$C$4,data!D11,data!D43)),\"\",CHOOSE(control!$C$4,data!D11,data!D43))","v":""},{"$f":"IF(ISBLANK(CHOOSE(control!$C$4,data!E11,data!E43)),\"\",CHOOSE(control!$C$4,data!E11,data!E43))","v":""},{"$f":"IF(ISBLANK(CHOOSE(control!$C$4,data!F11,data!F43)),\"\",CHOOSE(control!$C$4,data!F11,data!F43))","v":""},{"$f":"IF(ISBLANK(CHOOSE(control!$C$4,data!G11,data!G43)),\"\",CHOOSE(control!$C$4,data!G11,data!G43))","v":""},{"$f":"IF(ISBLANK(CHOOSE(control!$C$4,data!H11,data!H43)),\"\",CHOOSE(control!$C$4,data!H11,data!H43))","v":""},{"$f":"IF(ISBLANK(CHOOSE(control!$C$4,data!I11,data!I43)),\"\",CHOOSE(control!$C$4,data!I11,data!I43))","v":""},{"$f":"IF(ISBLANK(CHOOSE(control!$C$4,data!J11,data!J43)),\"\",CHOOSE(control!$C$4,data!J11,data!J43))","v":""},{"$f":"IF(ISBLANK(CHOOSE(control!$C$4,data!K11,data!K43)),\"\",CHOOSE(control!$C$4,data!K11,data!K43))","v":""},{"$f":"IF(ISBLANK(CHOOSE(control!$C$4,data!L11,data!L43)),\"\",CHOOSE(control!$C$4,data!L11,data!L43))","v":""},{"$f":"IF(ISBLANK(CHOOSE(control!$C$4,data!M11,data!M43)),\"\",CHOOSE(control!$C$4,data!M11,data!M43))","v":""},{"$f":"IF(ISBLANK(CHOOSE(control!$C$4,data!N11,data!N43)),\"\",CHOOSE(control!$C$4,data!N11,data!N43))","v":4.2000000000000003E-2},{"$f":"IF(ISBLANK(CHOOSE(control!$C$4,data!O11,data!O43)),\"\",CHOOSE(control!$C$4,data!O11,data!O43))","v":3.4000000000000002E-2},{"$f":"IF(ISBLANK(CHOOSE(control!$C$4,data!P11,data!P43)),\"\",CHOOSE(control!$C$4,data!P11,data!P43))","v":0.03},{"$f":"IF(ISBLANK(CHOOSE(control!$C$4,data!Q11,data!Q43)),\"\",CHOOSE(control!$C$4,data!Q11,data!Q43))","v":3.6000000000000004E-2},{"$f":"IF(ISBLANK(CHOOSE(control!$C$4,data!R11,data!R43)),\"\",CHOOSE(control!$C$4,data!R11,data!R43))","v":0.04},{"$f":"IF(ISBLANK(CHOOSE(control!$C$4,data!S11,data!S43)),\"\",CHOOSE(control!$C$4,data!S11,data!S43))","v":4.2999999999999997E-2},{"$f":"IF(ISBLANK(CHOOSE(control!$C$4,data!T11,data!T43)),\"\",CHOOSE(control!$C$4,data!T11,data!T43))","v":3.9E-2},{"$f":"IF(ISBLANK(CHOOSE(control!$C$4,data!U11,data!U43)),\"\",CHOOSE(control!$C$4,data!U11,data!U43))","v":3.3000000000000002E-2},{"$f":"IF(ISBLANK(CHOOSE(control!$C$4,data!V11,data!V43)),\"\",CHOOSE(control!$C$4,data!V11,data!V43))","v":3.1E-2},{"$f":"IF(ISBLANK(CHOOSE(control!$C$4,data!W11,data!W43)),\"\",CHOOSE(control!$C$4,data!W11,data!W43))","v":4.4000000000000004E-2},{"$f":"IF(ISBLANK(CHOOSE(control!$C$4,data!X11,data!X43)),\"\",CHOOSE(control!$C$4,data!X11,data!X43))","v":5.0999999999999997E-2},{"$f":"IF(ISBLANK(CHOOSE(control!$C$4,data!Y11,data!Y43)),\"\",CHOOSE(control!$C$4,data!Y11,data!Y43))","v":6.4000000000000001E-2},{"$f":"IF(ISBLANK(CHOOSE(control!$C$4,data!Z11,data!Z43)),\"\",CHOOSE(control!$C$4,data!Z11,data!Z43))","v":0.10199999999999999},{"$f":"IF(ISBLANK(CHOOSE(control!$C$4,data!AA11,data!AA43)),\"\",CHOOSE(control!$C$4,data!AA11,data!AA43))","v":0.13600000000000001},{"$f":"IF(ISBLANK(CHOOSE(control!$C$4,data!AB11,data!AB43)),\"\",CHOOSE(control!$C$4,data!AB11,data!AB43))","v":0.14000000000000001}]
[null,null,{"$f":"data!B12","v":"Czech Republic"},{"$f":"IF(ISBLANK(CHOOSE(control!$C$4,data!D12,data!D44)),\"\",CHOOSE(control!$C$4,data!D12,data!D44))","v":""},{"$f":"IF(ISBLANK(CHOOSE(control!$C$4,data!E12,data!E44)),\"\",CHOOSE(control!$C$4,data!E12,data!E44))","v":""},{"$f":"IF(ISBLANK(CHOOSE(control!$C$4,data!F12,data!F44)),\"\",CHOOSE(control!$C$4,data!F12,data!F44))","v":""},{"$f":"IF(ISBLANK(CHOOSE(control!$C$4,data!G12,data!G44)),\"\",CHOOSE(control!$C$4,data!G12,data!G44))","v":3.5000000000000003E-2},{"$f":"IF(ISBLANK(CHOOSE(control!$C$4,data!H12,data!H44)),\"\",CHOOSE(control!$C$4,data!H12,data!H44))","v":3.4000000000000002E-2},{"$f":"IF(ISBLANK(CHOOSE(control!$C$4,data!I12,data!I44)),\"\",CHOOSE(control!$C$4,data!I12,data!I44))","v":3.3000000000000002E-2},{"$f":"IF(ISBLANK(CHOOSE(control!$C$4,data!J12,data!J44)),\"\",CHOOSE(control!$C$4,data!J12,data!J44))","v":3.2000000000000001E-2},{"$f":"IF(ISBLANK(CHOOSE(control!$C$4,data!K12,data!K44)),\"\",CHOOSE(control!$C$4,data!K12,data!K44))","v":4.0999999999999995E-2},{"$f":"IF(ISBLANK(CHOOSE(control!$C$4,data!L12,data!L44)),\"\",CHOOSE(control!$C$4,data!L12,data!L44))","v":5.2999999999999999E-2},{"$f":"IF(ISBLANK(CHOOSE(control!$C$4,data!M12,data!M44)),\"\",CHOOSE(control!$C$4,data!M12,data!M44))","v":7.2000000000000008E-2},{"$f":"IF(ISBLANK(CHOOSE(control!$C$4,data!N12,data!N44)),\"\",CHOOSE(control!$C$4,data!N12,data!N44))","v":7.400000000000001E-2},{"$f":"IF(ISBLANK(CHOOSE(control!$C$4,data!O12,data!O44)),\"\",CHOOSE(control!$C$4,data!O12,data!O44))","v":6.9000000000000006E-2},{"$f":"IF(ISBLANK(CHOOSE(control!$C$4,data!P12,data!P44)),\"\",CHOOSE(control!$C$4,data!P12,data!P44))","v":6.2E-2},{"$f":"IF(ISBLANK(CHOOSE(control!$C$4,data!Q12,data!Q44)),\"\",CHOOSE(control!$C$4,data!Q12,data!Q44))","v":6.6000000000000003E-2},{"$f":"IF(ISBLANK(CHOOSE(control!$C$4,data!R12,data!R44)),\"\",CHOOSE(control!$C$4,data!R12,data!R44))","v":7.0000000000000007E-2},{"$f":"IF(ISBLANK(CHOOSE(control!$C$4,data!S12,data!S44)),\"\",CHOOSE(control!$C$4,data!S12,data!S44))","v":6.8000000000000005E-2},{"$f":"IF(ISBLANK(CHOOSE(control!$C$4,data!T12,data!T44)),\"\",CHOOSE(control!$C$4,data!T12,data!T44))","v":6.2E-2},{"$f":"IF(ISBLANK(CHOOSE(control!$C$4,data!U12,data!U44)),\"\",CHOOSE(control!$C$4,data!U12,data!U44))","v":4.8000000000000001E-2},{"$f":"IF(ISBLANK(CHOOSE(control!$C$4,data!V12,data!V44)),\"\",CHOOSE(control!$C$4,data!V12,data!V44))","v":3.9E-2},{"$f":"IF(ISBLANK(CHOOSE(control!$C$4,data!W12,data!W44)),\"\",CHOOSE(control!$C$4,data!W12,data!W44))","v":5.7999999999999996E-2},{"$f":"IF(ISBLANK(CHOOSE(control!$C$4,data!X12,data!X44)),\"\",CHOOSE(control!$C$4,data!X12,data!X44))","v":6.4000000000000001E-2},{"$f":"IF(ISBLANK(CHOOSE(control!$C$4,data!Y12,data!Y44)),\"\",CHOOSE(control!$C$4,data!Y12,data!Y44))","v":5.9000000000000004E-2},{"$f":"IF(ISBLANK(CHOOSE(control!$C$4,data!Z12,data!Z44)),\"\",CHOOSE(control!$C$4,data!Z12,data!Z44))","v":0.06},{"$f":"IF(ISBLANK(CHOOSE(control!$C$4,data!AA12,data!AA44)),\"\",CHOOSE(control!$C$4,data!AA12,data!AA44))","v":6.0999999999999999E-2},{"$f":"IF(ISBLANK(CHOOSE(control!$C$4,data!AB12,data!AB44)),\"\",CHOOSE(control!$C$4,data!AB12,data!AB44))","v":5.4000000000000006E-2}]
[null,null,{"$f":"data!B13","v":"Denmark"},{"$f":"IF(ISBLANK(CHOOSE(control!$C$4,data!D13,data!D45)),\"\",CHOOSE(control!$C$4,data!D13,data!D45))","v":6.4000000000000001E-2},{"$f":"IF(ISBLANK(CHOOSE(control!$C$4,data!E13,data!E45)),\"\",CHOOSE(control!$C$4,data!E13,data!E45))","v":7.2000000000000008E-2},{"$f":"IF(ISBLANK(CHOOSE(control!$C$4,data!F13,data!F45)),\"\",CHOOSE(control!$C$4,data!F13,data!F45))","v":7.9000000000000001E-2},{"$f":"IF(ISBLANK(CHOOSE(control!$C$4,data!G13,data!G45)),\"\",CHOOSE(control!$C$4,data!G13,data!G45))","v":8.900000000000001E-2},{"$f":"IF(ISBLANK(CHOOSE(control!$C$4,data!H13,data!H45)),\"\",CHOOSE(control!$C$4,data!H13,data!H45))","v":7.2000000000000008E-2},{"$f":"IF(ISBLANK(CHOOSE(control!$C$4,data!I13,data!I45)),\"\",CHOOSE(control!$C$4,data!I13,data!I45))","v":6.0999999999999999E-2},{"$f":"IF(ISBLANK(CHOOSE(control!$C$4,data!J13,data!J45)),\"\",CHOOSE(control!$C$4,data!J13,data!J45))","v":5.5999999999999994E-2},{"$f":"IF(ISBLANK(CHOOSE(control!$C$4,data!K13,data!K45)),\"\",CHOOSE(control!$C$4,data!K13,data!K45))","v":4.7E-2},{"$f":"IF(ISBLANK(CHOOSE(control!$C$4,data!L13,data!L45)),\"\",CHOOSE(control!$C$4,data!L13,data!L45))","v":4.4000000000000004E-2},{"$f":"IF(ISBLANK(CHOOSE(control!$C$4,data!M13,data!M45)),\"\",CHOOSE(control!$C$4,data!M13,data!M45))","v":4.4000000000000004E-2},{"$f":"IF(ISBLANK(CHOOSE(control!$C$4,data!N13,data!N45)),\"\",CHOOSE(control!$C$4,data!N13,data!N45))","v":0.04},{"$f":"IF(ISBLANK(CHOOSE(control!$C$4,data!O13,data!O45)),\"\",CHOOSE(control!$C$4,data!O13,data!O45))","v":3.9E-2},{"$f":"IF(ISBLANK(CHOOSE(control!$C$4,data!P13,data!P45)),\"\",CHOOSE(control!$C$4,data!P13,data!P45))","v":4.0999999999999995E-2},{"$f":"IF(ISBLANK(CHOOSE(control!$C$4,data!Q13,data!Q45)),\"\",CHOOSE(control!$C$4,data!Q13,data!Q45))","v":4.8000000000000001E-2},{"$f":"IF(ISBLANK(CHOOSE(control!$C$4,data!R13,data!R45)),\"\",CHOOSE(control!$C$4,data!R13,data!R45))","v":5.0999999999999997E-2},{"$f":"IF(ISBLANK(CHOOSE(control!$C$4,data!S13,data!S45)),\"\",CHOOSE(control!$C$4,data!S13,data!S45))","v":4.2000000000000003E-2},{"$f":"IF(ISBLANK(CHOOSE(control!$C$4,data!T13,data!T45)),\"\",CHOOSE(control!$C$4,data!T13,data!T45))","v":3.2000000000000001E-2},{"$f":"IF(ISBLANK(CHOOSE(control!$C$4,data!U13,data!U45)),\"\",CHOOSE(control!$C$4,data!U13,data!U45))","v":3.2000000000000001E-2},{"$f":"IF(ISBLANK(CHOOSE(control!$C$4,data!V13,data!V45)),\"\",CHOOSE(control!$C$4,data!V13,data!V45))","v":2.6000000000000002E-2},{"$f":"IF(ISBLANK(CHOOSE(control!$C$4,data!W13,data!W45)),\"\",CHOOSE(control!$C$4,data!W13,data!W45))","v":4.9000000000000002E-2},{"$f":"IF(ISBLANK(CHOOSE(control!$C$4,data!X13,data!X45)),\"\",CHOOSE(control!$C$4,data!X13,data!X45))","v":6.3E-2},{"$f":"IF(ISBLANK(CHOOSE(control!$C$4,data!Y13,data!Y45)),\"\",CHOOSE(control!$C$4,data!Y13,data!Y45))","v":6.3E-2},{"$f":"IF(ISBLANK(CHOOSE(control!$C$4,data!Z13,data!Z45)),\"\",CHOOSE(control!$C$4,data!Z13,data!Z45))","v":6.3E-2},{"$f":"IF(ISBLANK(CHOOSE(control!$C$4,data!AA13,data!AA45)),\"\",CHOOSE(control!$C$4,data!AA13,data!AA45))","v":5.9000000000000004E-2},{"$f":"IF(ISBLANK(CHOOSE(control!$C$4,data!AB13,data!AB45)),\"\",CHOOSE(control!$C$4,data!AB13,data!AB45))","v":5.5E-2}]
[null,null,{"$f":"data!B14","v":"Estonia"},{"$f":"IF(ISBLANK(CHOOSE(control!$C$4,data!D14,data!D46)),\"\",CHOOSE(control!$C$4,data!D14,data!D46))","v":""},{"$f":"IF(ISBLANK(CHOOSE(control!$C$4,data!E14,data!E46)),\"\",CHOOSE(control!$C$4,data!E14,data!E46))","v":""},{"$f":"IF(ISBLANK(CHOOSE(control!$C$4,data!F14,data!F46)),\"\",CHOOSE(control!$C$4,data!F14,data!F46))","v":""},{"$f":"IF(ISBLANK(CHOOSE(control!$C$4,data!G14,data!G46)),\"\",CHOOSE(control!$C$4,data!G14,data!G46))","v":""},{"$f":"IF(ISBLANK(CHOOSE(control!$C$4,data!H14,data!H46)),\"\",CHOOSE(control!$C$4,data!H14,data!H46))","v":""},{"$f":"IF(ISBLANK(CHOOSE(control!$C$4,data!I14,data!I46)),\"\",CHOOSE(control!$C$4,data!I14,data!I46))","v":""},{"$f":"IF(ISBLANK(CHOOSE(control!$C$4,data!J14,data!J46)),\"\",CHOOSE(control!$C$4,data!J14,data!J46))","v":""},{"$f":"IF(ISBLANK(CHOOSE(control!$C$4,data!K14,data!K46)),\"\",CHOOSE(control!$C$4,data!K14,data!K46))","v":""},{"$f":"IF(ISBLANK(CHOOSE(control!$C$4,data!L14,data!L46)),\"\",CHOOSE(control!$C$4,data!L14,data!L46))","v":""},{"$f":"IF(ISBLANK(CHOOSE(control!$C$4,data!M14,data!M46)),\"\",CHOOSE(control!$C$4,data!M14,data!M46))","v":""},{"$f":"IF(ISBLANK(CHOOSE(control!$C$4,data!N14,data!N46)),\"\",CHOOSE(control!$C$4,data!N14,data!N46))","v":0.13400000000000001},{"$f":"IF(ISBLANK(CHOOSE(control!$C$4,data!O14,data!O46)),\"\",CHOOSE(control!$C$4,data!O14,data!O46))","v":0.11900000000000001},{"$f":"IF(ISBLANK(CHOOSE(control!$C$4,data!P14,data!P46)),\"\",CHOOSE(control!$C$4,data!P14,data!P46))","v":0.105},{"$f":"IF(ISBLANK(CHOOSE(control!$C$4,data!Q14,data!Q46)),\"\",CHOOSE(control!$C$4,data!Q14,data!Q46))","v":0.09},{"$f":"IF(ISBLANK(CHOOSE(control!$C$4,data!R14,data!R46)),\"\",CHOOSE(control!$C$4,data!R14,data!R46))","v":8.4000000000000005E-2},{"$f":"IF(ISBLANK(CHOOSE(control!$C$4,data!S14,data!S46)),\"\",CHOOSE(control!$C$4,data!S14,data!S46))","v":7.2000000000000008E-2},{"$f":"IF(ISBLANK(CHOOSE(control!$C$4,data!T14,data!T46)),\"\",CHOOSE(control!$C$4,data!T14,data!T46))","v":5.2000000000000005E-2},{"$f":"IF(ISBLANK(CHOOSE(control!$C$4,data!U14,data!U46)),\"\",CHOOSE(control!$C$4,data!U14,data!U46))","v":3.9E-2},{"$f":"IF(ISBLANK(CHOOSE(control!$C$4,data!V14,data!V46)),\"\",CHOOSE(control!$C$4,data!V14,data!V46))","v":4.5999999999999999E-2},{"$f":"IF(ISBLANK(CHOOSE(control!$C$4,data!W14,data!W46)),\"\",CHOOSE(control!$C$4,data!W14,data!W46))","v":0.11900000000000001},{"$f":"IF(ISBLANK(CHOOSE(control!$C$4,data!X14,data!X46)),\"\",CHOOSE(control!$C$4,data!X14,data!X46))","v":0.14899999999999999},{"$f":"IF(ISBLANK(CHOOSE(control!$C$4,data!Y14,data!Y46)),\"\",CHOOSE(control!$C$4,data!Y14,data!Y46))","v":0.11199999999999999},{"$f":"IF(ISBLANK(CHOOSE(control!$C$4,data!Z14,data!Z46)),\"\",CHOOSE(control!$C$4,data!Z14,data!Z46))","v":8.900000000000001E-2},{"$f":"IF(ISBLANK(CHOOSE(control!$C$4,data!AA14,data!AA46)),\"\",CHOOSE(control!$C$4,data!AA14,data!AA46))","v":7.5999999999999998E-2},{"$f":"IF(ISBLANK(CHOOSE(control!$C$4,data!AB14,data!AB46)),\"\",CHOOSE(control!$C$4,data!AB14,data!AB46))","v":6.7000000000000004E-2}]
[null,null,{"$f":"data!B15","v":"Finland"},{"$f":"IF(ISBLANK(CHOOSE(control!$C$4,data!D15,data!D47)),\"\",CHOOSE(control!$C$4,data!D15,data!D47))","v":2.1000000000000001E-2},{"$f":"IF(ISBLANK(CHOOSE(control!$C$4,data!E15,data!E47)),\"\",CHOOSE(control!$C$4,data!E15,data!E47))","v":5.0999999999999997E-2},{"$f":"IF(ISBLANK(CHOOSE(control!$C$4,data!F15,data!F47)),\"\",CHOOSE(control!$C$4,data!F15,data!F47))","v":9.6000000000000002E-2},{"$f":"IF(ISBLANK(CHOOSE(control!$C$4,data!G15,data!G47)),\"\",CHOOSE(control!$C$4,data!G15,data!G47))","v":0.14099999999999999},{"$f":"IF(ISBLANK(CHOOSE(control!$C$4,data!H15,data!H47)),\"\",CHOOSE(control!$C$4,data!H15,data!H47))","v":0.14499999999999999},{"$f":"IF(ISBLANK(CHOOSE(control!$C$4,data!I15,data!I47)),\"\",CHOOSE(control!$C$4,data!I15,data!I47))","v":0.13699999999999998},{"$f":"IF(ISBLANK(CHOOSE(control!$C$4,data!J15,data!J47)),\"\",CHOOSE(control!$C$4,data!J15,data!J47))","v":0.13},{"$f":"IF(ISBLANK(CHOOSE(control!$C$4,data!K15,data!K47)),\"\",CHOOSE(control!$C$4,data!K15,data!K47))","v":0.11},{"$f":"IF(ISBLANK(CHOOSE(control!$C$4,data!L15,data!L47)),\"\",CHOOSE(control!$C$4,data!L15,data!L47))","v":9.6999999999999989E-2},{"$f":"IF(ISBLANK(CHOOSE(control!$C$4,data!M15,data!M47)),\"\",CHOOSE(control!$C$4,data!M15,data!M47))","v":8.5999999999999993E-2},{"$f":"IF(ISBLANK(CHOOSE(control!$C$4,data!N15,data!N47)),\"\",CHOOSE(control!$C$4,data!N15,data!N47))","v":8.1000000000000003E-2},{"$f":"IF(ISBLANK(CHOOSE(control!$C$4,data!O15,data!O47)),\"\",CHOOSE(control!$C$4,data!O15,data!O47))","v":7.5999999999999998E-2},{"$f":"IF(ISBLANK(CHOOSE(control!$C$4,data!P15,data!P47)),\"\",CHOOSE(control!$C$4,data!P15,data!P47))","v":7.400000000000001E-2},{"$f":"IF(ISBLANK(CHOOSE(control!$C$4,data!Q15,data!Q47)),\"\",CHOOSE(control!$C$4,data!Q15,data!Q47))","v":7.2000000000000008E-2},{"$f":"IF(ISBLANK(CHOOSE(control!$C$4,data!R15,data!R47)),\"\",CHOOSE(control!$C$4,data!R15,data!R47))","v":7.2000000000000008E-2},{"$f":"IF(ISBLANK(CHOOSE(control!$C$4,data!S15,data!S47)),\"\",CHOOSE(control!$C$4,data!S15,data!S47))","v":6.8000000000000005E-2},{"$f":"IF(ISBLANK(CHOOSE(control!$C$4,data!T15,data!T47)),\"\",CHOOSE(control!$C$4,data!T15,data!T47))","v":6.2E-2},{"$f":"IF(ISBLANK(CHOOSE(control!$C$4,data!U15,data!U47)),\"\",CHOOSE(control!$C$4,data!U15,data!U47))","v":5.4000000000000006E-2},{"$f":"IF(ISBLANK(CHOOSE(control!$C$4,data!V15,data!V47)),\"\",CHOOSE(control!$C$4,data!V15,data!V47))","v":4.9000000000000002E-2},{"$f":"IF(ISBLANK(CHOOSE(control!$C$4,data!W15,data!W47)),\"\",CHOOSE(control!$C$4,data!W15,data!W47))","v":6.4000000000000001E-2},{"$f":"IF(ISBLANK(CHOOSE(control!$C$4,data!X15,data!X47)),\"\",CHOOSE(control!$C$4,data!X15,data!X47))","v":6.6000000000000003E-2},{"$f":"IF(ISBLANK(CHOOSE(control!$C$4,data!Y15,data!Y47)),\"\",CHOOSE(control!$C$4,data!Y15,data!Y47))","v":6.0999999999999999E-2},{"$f":"IF(ISBLANK(CHOOSE(control!$C$4,data!Z15,data!Z47)),\"\",CHOOSE(control!$C$4,data!Z15,data!Z47))","v":6.0999999999999999E-2},{"$f":"IF(ISBLANK(CHOOSE(control!$C$4,data!AA15,data!AA47)),\"\",CHOOSE(control!$C$4,data!AA15,data!AA47))","v":6.5000000000000002E-2},{"$f":"IF(ISBLANK(CHOOSE(control!$C$4,data!AB15,data!AB47)),\"\",CHOOSE(control!$C$4,data!AB15,data!AB47))","v":7.0000000000000007E-2}]
[null,null,{"$f":"data!B16","v":"France"},{"$f":"IF(ISBLANK(CHOOSE(control!$C$4,data!D16,data!D48)),\"\",CHOOSE(control!$C$4,data!D16,data!D48))","v":5.2000000000000005E-2},{"$f":"IF(ISBLANK(CHOOSE(control!$C$4,data!E16,data!E48)),\"\",CHOOSE(control!$C$4,data!E16,data!E48))","v":5.2000000000000005E-2},{"$f":"IF(ISBLANK(CHOOSE(control!$C$4,data!F16,data!F48)),\"\",CHOOSE(control!$C$4,data!F16,data!F48))","v":5.7000000000000002E-2},{"$f":"IF(ISBLANK(CHOOSE(control!$C$4,data!G16,data!G48)),\"\",CHOOSE(control!$C$4,data!G16,data!G48))","v":6.0999999999999999E-2},{"$f":"IF(ISBLANK(CHOOSE(control!$C$4,data!H16,data!H48)),\"\",CHOOSE(control!$C$4,data!H16,data!H48))","v":6.3E-2},{"$f":"IF(ISBLANK(CHOOSE(control!$C$4,data!I16,data!I48)),\"\",CHOOSE(control!$C$4,data!I16,data!I48))","v":6.2E-2},{"$f":"IF(ISBLANK(CHOOSE(control!$C$4,data!J16,data!J48)),\"\",CHOOSE(control!$C$4,data!J16,data!J48))","v":6.3E-2},{"$f":"IF(ISBLANK(CHOOSE(control!$C$4,data!K16,data!K48)),\"\",CHOOSE(control!$C$4,data!K16,data!K48))","v":6.3E-2},{"$f":"IF(ISBLANK(CHOOSE(control!$C$4,data!L16,data!L48)),\"\",CHOOSE(control!$C$4,data!L16,data!L48))","v":6.0999999999999999E-2},{"$f":"IF(ISBLANK(CHOOSE(control!$C$4,data!M16,data!M48)),\"\",CHOOSE(control!$C$4,data!M16,data!M48))","v":0.06},{"$f":"IF(ISBLANK(CHOOSE(control!$C$4,data!N16,data!N48)),\"\",CHOOSE(control!$C$4,data!N16,data!N48))","v":5.2000000000000005E-2},{"$f":"IF(ISBLANK(CHOOSE(control!$C$4,data!O16,data!O48)),\"\",CHOOSE(control!$C$4,data!O16,data!O48))","v":4.8000000000000001E-2},{"$f":"IF(ISBLANK(CHOOSE(control!$C$4,data!P16,data!P48)),\"\",CHOOSE(control!$C$4,data!P16,data!P48))","v":4.7E-2},{"$f":"IF(ISBLANK(CHOOSE(control!$C$4,data!Q16,data!Q48)),\"\",CHOOSE(control!$C$4,data!Q16,data!Q48))","v":7.2999999999999995E-2},{"$f":"IF(ISBLANK(CHOOSE(control!$C$4,data!R16,data!R48)),\"\",CHOOSE(control!$C$4,data!R16,data!R48))","v":7.4999999999999997E-2},{"$f":"IF(ISBLANK(CHOOSE(control!$C$4,data!S16,data!S48)),\"\",CHOOSE(control!$C$4,data!S16,data!S48))","v":7.4999999999999997E-2},{"$f":"IF(ISBLANK(CHOOSE(control!$C$4,data!T16,data!T48)),\"\",CHOOSE(control!$C$4,data!T16,data!T48))","v":7.2999999999999995E-2},{"$f":"IF(ISBLANK(CHOOSE(control!$C$4,data!U16,data!U48)),\"\",CHOOSE(control!$C$4,data!U16,data!U48))","v":6.7000000000000004E-2},{"$f":"IF(ISBLANK(CHOOSE(control!$C$4,data!V16,data!V48)),\"\",CHOOSE(control!$C$4,data!V16,data!V48))","v":6.0999999999999999E-2},{"$f":"IF(ISBLANK(CHOOSE(control!$C$4,data!W16,data!W48)),\"\",CHOOSE(control!$C$4,data!W16,data!W48))","v":7.400000000000001E-2},{"$f":"IF(ISBLANK(CHOOSE(control!$C$4,data!X16,data!X48)),\"\",CHOOSE(control!$C$4,data!X16,data!X48))","v":7.6999999999999999E-2},{"$f":"IF(ISBLANK(CHOOSE(control!$C$4,data!Y16,data!Y48)),\"\",CHOOSE(control!$C$4,data!Y16,data!Y48))","v":7.6999999999999999E-2},{"$f":"IF(ISBLANK(CHOOSE(control!$C$4,data!Z16,data!Z48)),\"\",CHOOSE(control!$C$4,data!Z16,data!Z48))","v":8.199999999999999E-2},{"$f":"IF(ISBLANK(CHOOSE(control!$C$4,data!AA16,data!AA48)),\"\",CHOOSE(control!$C$4,data!AA16,data!AA48))","v":8.6999999999999994E-2},{"$f":"IF(ISBLANK(CHOOSE(control!$C$4,data!AB16,data!AB48)),\"\",CHOOSE(control!$C$4,data!AB16,data!AB48))","v":8.6999999999999994E-2}]
[null,null,{"$f":"data!B17","v":"Germany"},{"$f":"IF(ISBLANK(CHOOSE(control!$C$4,data!D17,data!D49)),\"\",CHOOSE(control!$C$4,data!D17,data!D49))","v":""},{"$f":"IF(ISBLANK(CHOOSE(control!$C$4,data!E17,data!E49)),\"\",CHOOSE(control!$C$4,data!E17,data!E49))","v":5.5E-2},{"$f":"IF(ISBLANK(CHOOSE(control!$C$4,data!F17,data!F49)),\"\",CHOOSE(control!$C$4,data!F17,data!F49))","v":6.6000000000000003E-2},{"$f":"IF(ISBLANK(CHOOSE(control!$C$4,data!G17,data!G49)),\"\",CHOOSE(control!$C$4,data!G17,data!G49))","v":7.6999999999999999E-2},{"$f":"IF(ISBLANK(CHOOSE(control!$C$4,data!H17,data!H49)),\"\",CHOOSE(control!$C$4,data!H17,data!H49))","v":8.4000000000000005E-2},{"$f":"IF(ISBLANK(CHOOSE(control!$C$4,data!I17,data!I49)),\"\",CHOOSE(control!$C$4,data!I17,data!I49))","v":8.1000000000000003E-2},{"$f":"IF(ISBLANK(CHOOSE(control!$C$4,data!J17,data!J49)),\"\",CHOOSE(control!$C$4,data!J17,data!J49))","v":8.8000000000000009E-2},{"$f":"IF(ISBLANK(CHOOSE(control!$C$4,data!K17,data!K49)),\"\",CHOOSE(control!$C$4,data!K17,data!K49))","v":9.5000000000000001E-2},{"$f":"IF(ISBLANK(CHOOSE(control!$C$4,data!L17,data!L49)),\"\",CHOOSE(control!$C$4,data!L17,data!L49))","v":9.3000000000000013E-2},{"$f":"IF(ISBLANK(CHOOSE(control!$C$4,data!M17,data!M49)),\"\",CHOOSE(control!$C$4,data!M17,data!M49))","v":8.5000000000000006E-2},{"$f":"IF(ISBLANK(CHOOSE(control!$C$4,data!N17,data!N49)),\"\",CHOOSE(control!$C$4,data!N17,data!N49))","v":7.9000000000000001E-2},{"$f":"IF(ISBLANK(CHOOSE(control!$C$4,data!O17,data!O49)),\"\",CHOOSE(control!$C$4,data!O17,data!O49))","v":7.6999999999999999E-2},{"$f":"IF(ISBLANK(CHOOSE(control!$C$4,data!P17,data!P49)),\"\",CHOOSE(control!$C$4,data!P17,data!P49))","v":8.5000000000000006E-2},{"$f":"IF(ISBLANK(CHOOSE(control!$C$4,data!Q17,data!Q49)),\"\",CHOOSE(control!$C$4,data!Q17,data!Q49))","v":9.5000000000000001E-2},{"$f":"IF(ISBLANK(CHOOSE(control!$C$4,data!R17,data!R49)),\"\",CHOOSE(control!$C$4,data!R17,data!R49))","v":0.1},{"$f":"IF(ISBLANK(CHOOSE(control!$C$4,data!S17,data!S49)),\"\",CHOOSE(control!$C$4,data!S17,data!S49))","v":0.106},{"$f":"IF(ISBLANK(CHOOSE(control!$C$4,data!T17,data!T49)),\"\",CHOOSE(control!$C$4,data!T17,data!T49))","v":9.6999999999999989E-2},{"$f":"IF(ISBLANK(CHOOSE(control!$C$4,data!U17,data!U49)),\"\",CHOOSE(control!$C$4,data!U17,data!U49))","v":8.1000000000000003E-2},{"$f":"IF(ISBLANK(CHOOSE(control!$C$4,data!V17,data!V49)),\"\",CHOOSE(control!$C$4,data!V17,data!V49))","v":7.0000000000000007E-2},{"$f":"IF(ISBLANK(CHOOSE(control!$C$4,data!W17,data!W49)),\"\",CHOOSE(control!$C$4,data!W17,data!W49))","v":7.2000000000000008E-2},{"$f":"IF(ISBLANK(CHOOSE(control!$C$4,data!X17,data!X49)),\"\",CHOOSE(control!$C$4,data!X17,data!X49))","v":6.6000000000000003E-2},{"$f":"IF(ISBLANK(CHOOSE(control!$C$4,data!Y17,data!Y49)),\"\",CHOOSE(control!$C$4,data!Y17,data!Y49))","v":5.5E-2},{"$f":"IF(ISBLANK(CHOOSE(control!$C$4,data!Z17,data!Z49)),\"\",CHOOSE(control!$C$4,data!Z17,data!Z49))","v":5.0999999999999997E-2},{"$f":"IF(ISBLANK(CHOOSE(control!$C$4,data!AA17,data!AA49)),\"\",CHOOSE(control!$C$4,data!AA17,data!AA49))","v":4.9000000000000002E-2},{"$f":"IF(ISBLANK(CHOOSE(control!$C$4,data!AB17,data!AB49)),\"\",CHOOSE(control!$C$4,data!AB17,data!AB49))","v":4.7E-2}]
[null,null,{"$f":"data!B18","v":"Greece"},{"$f":"IF(ISBLANK(CHOOSE(control!$C$4,data!D18,data!D50)),\"\",CHOOSE(control!$C$4,data!D18,data!D50))","v":""},{"$f":"IF(ISBLANK(CHOOSE(control!$C$4,data!E18,data!E50)),\"\",CHOOSE(control!$C$4,data!E18,data!E50))","v":""},{"$f":"IF(ISBLANK(CHOOSE(control!$C$4,data!F18,data!F50)),\"\",CHOOSE(control!$C$4,data!F18,data!F50))","v":""},{"$f":"IF(ISBLANK(CHOOSE(control!$C$4,data!G18,data!G50)),\"\",CHOOSE(control!$C$4,data!G18,data!G50))","v":""},{"$f":"IF(ISBLANK(CHOOSE(control!$C$4,data!H18,data!H50)),\"\",CHOOSE(control!$C$4,data!H18,data!H50))","v":""},{"$f":"IF(ISBLANK(CHOOSE(control!$C$4,data!I18,data!I50)),\"\",CHOOSE(control!$C$4,data!I18,data!I50))","v":""},{"$f":"IF(ISBLANK(CHOOSE(control!$C$4,data!J18,data!J50)),\"\",CHOOSE(control!$C$4,data!J18,data!J50))","v":""},{"$f":"IF(ISBLANK(CHOOSE(control!$C$4,data!K18,data!K50)),\"\",CHOOSE(control!$C$4,data!K18,data!K50))","v":""},{"$f":"IF(ISBLANK(CHOOSE(control!$C$4,data!L18,data!L50)),\"\",CHOOSE(control!$C$4,data!L18,data!L50))","v":8.199999999999999E-2},{"$f":"IF(ISBLANK(CHOOSE(control!$C$4,data!M18,data!M50)),\"\",CHOOSE(control!$C$4,data!M18,data!M50))","v":9.0999999999999998E-2},{"$f":"IF(ISBLANK(CHOOSE(control!$C$4,data!N18,data!N50)),\"\",CHOOSE(control!$C$4,data!N18,data!N50))","v":8.6999999999999994E-2},{"$f":"IF(ISBLANK(CHOOSE(control!$C$4,data!O18,data!O50)),\"\",CHOOSE(control!$C$4,data!O18,data!O50))","v":8.5000000000000006E-2},{"$f":"IF(ISBLANK(CHOOSE(control!$C$4,data!P18,data!P50)),\"\",CHOOSE(control!$C$4,data!P18,data!P50))","v":8.4000000000000005E-2},{"$f":"IF(ISBLANK(CHOOSE(control!$C$4,data!Q18,data!Q50)),\"\",CHOOSE(control!$C$4,data!Q18,data!Q50))","v":7.9000000000000001E-2},{"$f":"IF(ISBLANK(CHOOSE(control!$C$4,data!R18,data!R50)),\"\",CHOOSE(control!$C$4,data!R18,data!R50))","v":8.8000000000000009E-2},{"$f":"IF(ISBLANK(CHOOSE(control!$C$4,data!S18,data!S50)),\"\",CHOOSE(control!$C$4,data!S18,data!S50))","v":8.4000000000000005E-2},{"$f":"IF(ISBLANK(CHOOSE(control!$C$4,data!T18,data!T50)),\"\",CHOOSE(control!$C$4,data!T18,data!T50))","v":7.4999999999999997E-2},{"$f":"IF(ISBLANK(CHOOSE(control!$C$4,data!U18,data!U50)),\"\",CHOOSE(control!$C$4,data!U18,data!U50))","v":7.2000000000000008E-2},{"$f":"IF(ISBLANK(CHOOSE(control!$C$4,data!V18,data!V50)),\"\",CHOOSE(control!$C$4,data!V18,data!V50))","v":6.6000000000000003E-2},{"$f":"IF(ISBLANK(CHOOSE(control!$C$4,data!W18,data!W50)),\"\",CHOOSE(control!$C$4,data!W18,data!W50))","v":8.4000000000000005E-2},{"$f":"IF(ISBLANK(CHOOSE(control!$C$4,data!X18,data!X50)),\"\",CHOOSE(control!$C$4,data!X18,data!X50))","v":0.11199999999999999},{"$f":"IF(ISBLANK(CHOOSE(control!$C$4,data!Y18,data!Y50)),\"\",CHOOSE(control!$C$4,data!Y18,data!Y50))","v":0.159},{"$f":"IF(ISBLANK(CHOOSE(control!$C$4,data!Z18,data!Z50)),\"\",CHOOSE(control!$C$4,data!Z18,data!Z50))","v":0.223},{"$f":"IF(ISBLANK(CHOOSE(control!$C$4,data!AA18,data!AA50)),\"\",CHOOSE(control!$C$4,data!AA18,data!AA50))","v":0.254},{"$f":"IF(ISBLANK(CHOOSE(control!$C$4,data!AB18,data!AB50)),\"\",CHOOSE(control!$C$4,data!AB18,data!AB50))","v":0.248}]
[null,null,{"$f":"data!B19","v":"Hungary"},{"$f":"IF(ISBLANK(CHOOSE(control!$C$4,data!D19,data!D51)),\"\",CHOOSE(control!$C$4,data!D19,data!D51))","v":""},{"$f":"IF(ISBLANK(CHOOSE(control!$C$4,data!E19,data!E51)),\"\",CHOOSE(control!$C$4,data!E19,data!E51))","v":""},{"$f":"IF(ISBLANK(CHOOSE(control!$C$4,data!F19,data!F51)),\"\",CHOOSE(control!$C$4,data!F19,data!F51))","v":""},{"$f":"IF(ISBLANK(CHOOSE(control!$C$4,data!G19,data!G51)),\"\",CHOOSE(control!$C$4,data!G19,data!G51))","v":""},{"$f":"IF(ISBLANK(CHOOSE(control!$C$4,data!H19,data!H51)),\"\",CHOOSE(control!$C$4,data!H19,data!H51))","v":""},{"$f":"IF(ISBLANK(CHOOSE(control!$C$4,data!I19,data!I51)),\"\",CHOOSE(control!$C$4,data!I19,data!I51))","v":""},{"$f":"IF(ISBLANK(CHOOSE(control!$C$4,data!J19,data!J51)),\"\",CHOOSE(control!$C$4,data!J19,data!J51))","v":8.4000000000000005E-2},{"$f":"IF(ISBLANK(CHOOSE(control!$C$4,data!K19,data!K51)),\"\",CHOOSE(control!$C$4,data!K19,data!K51))","v":7.6999999999999999E-2},{"$f":"IF(ISBLANK(CHOOSE(control!$C$4,data!L19,data!L51)),\"\",CHOOSE(control!$C$4,data!L19,data!L51))","v":7.4999999999999997E-2},{"$f":"IF(ISBLANK(CHOOSE(control!$C$4,data!M19,data!M51)),\"\",CHOOSE(control!$C$4,data!M19,data!M51))","v":5.7999999999999996E-2},{"$f":"IF(ISBLANK(CHOOSE(control!$C$4,data!N19,data!N51)),\"\",CHOOSE(control!$C$4,data!N19,data!N51))","v":5.4000000000000006E-2},{"$f":"IF(ISBLANK(CHOOSE(control!$C$4,data!O19,data!O51)),\"\",CHOOSE(control!$C$4,data!O19,data!O51))","v":4.8000000000000001E-2},{"$f":"IF(ISBLANK(CHOOSE(control!$C$4,data!P19,data!P51)),\"\",CHOOSE(control!$C$4,data!P19,data!P51))","v":4.8000000000000001E-2},{"$f":"IF(ISBLANK(CHOOSE(control!$C$4,data!Q19,data!Q51)),\"\",CHOOSE(control!$C$4,data!Q19,data!Q51))","v":4.9000000000000002E-2},{"$f":"IF(ISBLANK(CHOOSE(control!$C$4,data!R19,data!R51)),\"\",CHOOSE(control!$C$4,data!R19,data!R51))","v":5.2000000000000005E-2},{"$f":"IF(ISBLANK(CHOOSE(control!$C$4,data!S19,data!S51)),\"\",CHOOSE(control!$C$4,data!S19,data!S51))","v":6.0999999999999999E-2},{"$f":"IF(ISBLANK(CHOOSE(control!$C$4,data!T19,data!T51)),\"\",CHOOSE(control!$C$4,data!T19,data!T51))","v":6.5000000000000002E-2},{"$f":"IF(ISBLANK(CHOOSE(control!$C$4,data!U19,data!U51)),\"\",CHOOSE(control!$C$4,data!U19,data!U51))","v":6.5000000000000002E-2},{"$f":"IF(ISBLANK(CHOOSE(control!$C$4,data!V19,data!V51)),\"\",CHOOSE(control!$C$4,data!V19,data!V51))","v":6.9000000000000006E-2},{"$f":"IF(ISBLANK(CHOOSE(control!$C$4,data!W19,data!W51)),\"\",CHOOSE(control!$C$4,data!W19,data!W51))","v":8.8000000000000009E-2},{"$f":"IF(ISBLANK(CHOOSE(control!$C$4,data!X19,data!X51)),\"\",CHOOSE(control!$C$4,data!X19,data!X51))","v":0.1},{"$f":"IF(ISBLANK(CHOOSE(control!$C$4,data!Y19,data!Y51)),\"\",CHOOSE(control!$C$4,data!Y19,data!Y51))","v":9.9000000000000005E-2},{"$f":"IF(ISBLANK(CHOOSE(control!$C$4,data!Z19,data!Z51)),\"\",CHOOSE(control!$C$4,data!Z19,data!Z51))","v":9.6999999999999989E-2},{"$f":"IF(ISBLANK(CHOOSE(control!$C$4,data!AA19,data!AA51)),\"\",CHOOSE(control!$C$4,data!AA19,data!AA51))","v":8.900000000000001E-2},{"$f":"IF(ISBLANK(CHOOSE(control!$C$4,data!AB19,data!AB51)),\"\",CHOOSE(control!$C$4,data!AB19,data!AB51))","v":6.7000000000000004E-2}]
[null,null,{"$f":"data!B20","v":"Ireland"},{"$f":"IF(ISBLANK(CHOOSE(control!$C$4,data!D20,data!D52)),\"\",CHOOSE(control!$C$4,data!D20,data!D52))","v":0.11699999999999999},{"$f":"IF(ISBLANK(CHOOSE(control!$C$4,data!E20,data!E52)),\"\",CHOOSE(control!$C$4,data!E20,data!E52))","v":0.126},{"$f":"IF(ISBLANK(CHOOSE(control!$C$4,data!F20,data!F52)),\"\",CHOOSE(control!$C$4,data!F20,data!F52))","v":0.13},{"$f":"IF(ISBLANK(CHOOSE(control!$C$4,data!G20,data!G52)),\"\",CHOOSE(control!$C$4,data!G20,data!G52))","v":0.13100000000000001},{"$f":"IF(ISBLANK(CHOOSE(control!$C$4,data!H20,data!H52)),\"\",CHOOSE(control!$C$4,data!H20,data!H52))","v":0.122},{"$f":"IF(ISBLANK(CHOOSE(control!$C$4,data!I20,data!I52)),\"\",CHOOSE(control!$C$4,data!I20,data!I52))","v":0.106},{"$f":"IF(ISBLANK(CHOOSE(control!$C$4,data!J20,data!J52)),\"\",CHOOSE(control!$C$4,data!J20,data!J52))","v":0.10199999999999999},{"$f":"IF(ISBLANK(CHOOSE(control!$C$4,data!K20,data!K52)),\"\",CHOOSE(control!$C$4,data!K20,data!K52))","v":8.5999999999999993E-2},{"$f":"IF(ISBLANK(CHOOSE(control!$C$4,data!L20,data!L52)),\"\",CHOOSE(control!$C$4,data!L20,data!L52))","v":6.6000000000000003E-2},{"$f":"IF(ISBLANK(CHOOSE(control!$C$4,data!M20,data!M52)),\"\",CHOOSE(control!$C$4,data!M20,data!M52))","v":4.9000000000000002E-2},{"$f":"IF(ISBLANK(CHOOSE(control!$C$4,data!N20,data!N52)),\"\",CHOOSE(control!$C$4,data!N20,data!N52))","v":3.6000000000000004E-2},{"$f":"IF(ISBLANK(CHOOSE(control!$C$4,data!O20,data!O52)),\"\",CHOOSE(control!$C$4,data!O20,data!O52))","v":3.2000000000000001E-2},{"$f":"IF(ISBLANK(CHOOSE(control!$C$4,data!P20,data!P52)),\"\",CHOOSE(control!$C$4,data!P20,data!P52))","v":3.6000000000000004E-2},{"$f":"IF(ISBLANK(CHOOSE(control!$C$4,data!Q20,data!Q52)),\"\",CHOOSE(control!$C$4,data!Q20,data!Q52))","v":3.7000000000000005E-2},{"$f":"IF(ISBLANK(CHOOSE(control!$C$4,data!R20,data!R52)),\"\",CHOOSE(control!$C$4,data!R20,data!R52))","v":3.6000000000000004E-2},{"$f":"IF(ISBLANK(CHOOSE(control!$C$4,data!S20,data!S52)),\"\",CHOOSE(control!$C$4,data!S20,data!S52))","v":3.5000000000000003E-2},{"$f":"IF(ISBLANK(CHOOSE(control!$C$4,data!T20,data!T52)),\"\",CHOOSE(control!$C$4,data!T20,data!T52))","v":3.7000000000000005E-2},{"$f":"IF(ISBLANK(CHOOSE(control!$C$4,data!U20,data!U52)),\"\",CHOOSE(control!$C$4,data!U20,data!U52))","v":3.7999999999999999E-2},{"$f":"IF(ISBLANK(CHOOSE(control!$C$4,data!V20,data!V52)),\"\",CHOOSE(control!$C$4,data!V20,data!V52))","v":5.2000000000000005E-2},{"$f":"IF(ISBLANK(CHOOSE(control!$C$4,data!W20,data!W52)),\"\",CHOOSE(control!$C$4,data!W20,data!W52))","v":0.10099999999999999},{"$f":"IF(ISBLANK(CHOOSE(control!$C$4,data!X20,data!X52)),\"\",CHOOSE(control!$C$4,data!X20,data!X52))","v":0.12},{"$f":"IF(ISBLANK(CHOOSE(control!$C$4,data!Y20,data!Y52)),\"\",CHOOSE(control!$C$4,data!Y20,data!Y52))","v":0.129},{"$f":"IF(ISBLANK(CHOOSE(control!$C$4,data!Z20,data!Z52)),\"\",CHOOSE(control!$C$4,data!Z20,data!Z52))","v":0.129},{"$f":"IF(ISBLANK(CHOOSE(control!$C$4,data!AA20,data!AA52)),\"\",CHOOSE(control!$C$4,data!AA20,data!AA52))","v":0.11599999999999999},{"$f":"IF(ISBLANK(CHOOSE(control!$C$4,data!AB20,data!AB52)),\"\",CHOOSE(control!$C$4,data!AB20,data!AB52))","v":0.1}]
[null,null,{"$f":"data!B21","v":"Italy"},{"$f":"IF(ISBLANK(CHOOSE(control!$C$4,data!D21,data!D53)),\"\",CHOOSE(control!$C$4,data!D21,data!D53))","v":""},{"$f":"IF(ISBLANK(CHOOSE(control!$C$4,data!E21,data!E53)),\"\",CHOOSE(control!$C$4,data!E21,data!E53))","v":""},{"$f":"IF(ISBLANK(CHOOSE(control!$C$4,data!F21,data!F53)),\"\",CHOOSE(control!$C$4,data!F21,data!F53))","v":5.5E-2},{"$f":"IF(ISBLANK(CHOOSE(control!$C$4,data!G21,data!G53)),\"\",CHOOSE(control!$C$4,data!G21,data!G53))","v":6.6000000000000003E-2},{"$f":"IF(ISBLANK(CHOOSE(control!$C$4,data!H21,data!H53)),\"\",CHOOSE(control!$C$4,data!H21,data!H53))","v":7.4999999999999997E-2},{"$f":"IF(ISBLANK(CHOOSE(control!$C$4,data!I21,data!I53)),\"\",CHOOSE(control!$C$4,data!I21,data!I53))","v":8.1000000000000003E-2},{"$f":"IF(ISBLANK(CHOOSE(control!$C$4,data!J21,data!J53)),\"\",CHOOSE(control!$C$4,data!J21,data!J53))","v":8.3000000000000004E-2},{"$f":"IF(ISBLANK(CHOOSE(control!$C$4,data!K21,data!K53)),\"\",CHOOSE(control!$C$4,data!K21,data!K53))","v":8.5000000000000006E-2},{"$f":"IF(ISBLANK(CHOOSE(control!$C$4,data!L21,data!L53)),\"\",CHOOSE(control!$C$4,data!L21,data!L53))","v":8.6999999999999994E-2},{"$f":"IF(ISBLANK(CHOOSE(control!$C$4,data!M21,data!M53)),\"\",CHOOSE(control!$C$4,data!M21,data!M53))","v":8.5000000000000006E-2},{"$f":"IF(ISBLANK(CHOOSE(control!$C$4,data!N21,data!N53)),\"\",CHOOSE(control!$C$4,data!N21,data!N53))","v":7.9000000000000001E-2},{"$f":"IF(ISBLANK(CHOOSE(control!$C$4,data!O21,data!O53)),\"\",CHOOSE(control!$C$4,data!O21,data!O53))","v":7.2999999999999995E-2},{"$f":"IF(ISBLANK(CHOOSE(control!$C$4,data!P21,data!P53)),\"\",CHOOSE(control!$C$4,data!P21,data!P53))","v":6.9000000000000006E-2},{"$f":"IF(ISBLANK(CHOOSE(control!$C$4,data!Q21,data!Q53)),\"\",CHOOSE(control!$C$4,data!Q21,data!Q53))","v":6.8000000000000005E-2},{"$f":"IF(ISBLANK(CHOOSE(control!$C$4,data!R21,data!R53)),\"\",CHOOSE(control!$C$4,data!R21,data!R53))","v":6.5000000000000002E-2},{"$f":"IF(ISBLANK(CHOOSE(control!$C$4,data!S21,data!S53)),\"\",CHOOSE(control!$C$4,data!S21,data!S53))","v":6.2E-2},{"$f":"IF(ISBLANK(CHOOSE(control!$C$4,data!T21,data!T53)),\"\",CHOOSE(control!$C$4,data!T21,data!T53))","v":5.5E-2},{"$f":"IF(ISBLANK(CHOOSE(control!$C$4,data!U21,data!U53)),\"\",CHOOSE(control!$C$4,data!U21,data!U53))","v":4.9000000000000002E-2},{"$f":"IF(ISBLANK(CHOOSE(control!$C$4,data!V21,data!V53)),\"\",CHOOSE(control!$C$4,data!V21,data!V53))","v":5.5999999999999994E-2},{"$f":"IF(ISBLANK(CHOOSE(control!$C$4,data!W21,data!W53)),\"\",CHOOSE(control!$C$4,data!W21,data!W53))","v":6.4000000000000001E-2},{"$f":"IF(ISBLANK(CHOOSE(control!$C$4,data!X21,data!X53)),\"\",CHOOSE(control!$C$4,data!X21,data!X53))","v":6.9000000000000006E-2},{"$f":"IF(ISBLANK(CHOOSE(control!$C$4,data!Y21,data!Y53)),\"\",CHOOSE(control!$C$4,data!Y21,data!Y53))","v":6.9000000000000006E-2},{"$f":"IF(ISBLANK(CHOOSE(control!$C$4,data!Z21,data!Z53)),\"\",CHOOSE(control!$C$4,data!Z21,data!Z53))","v":8.900000000000001E-2},{"$f":"IF(ISBLANK(CHOOSE(control!$C$4,data!AA21,data!AA53)),\"\",CHOOSE(control!$C$4,data!AA21,data!AA53))","v":0.10199999999999999},{"$f":"IF(ISBLANK(CHOOSE(control!$C$4,data!AB21,data!AB53)),\"\",CHOOSE(control!$C$4,data!AB21,data!AB53))","v":0.106}]
[null,null,{"$f":"data!B22","v":"Latvia"},{"$f":"IF(ISBLANK(CHOOSE(control!$C$4,data!D22,data!D54)),\"\",CHOOSE(control!$C$4,data!D22,data!D54))","v":""},{"$f":"IF(ISBLANK(CHOOSE(control!$C$4,data!E22,data!E54)),\"\",CHOOSE(control!$C$4,data!E22,data!E54))","v":""},{"$f":"IF(ISBLANK(CHOOSE(control!$C$4,data!F22,data!F54)),\"\",CHOOSE(control!$C$4,data!F22,data!F54))","v":""},{"$f":"IF(ISBLANK(CHOOSE(control!$C$4,data!G22,data!G54)),\"\",CHOOSE(control!$C$4,data!G22,data!G54))","v":""},{"$f":"IF(ISBLANK(CHOOSE(control!$C$4,data!H22,data!H54)),\"\",CHOOSE(control!$C$4,data!H22,data!H54))","v":""},{"$f":"IF(ISBLANK(CHOOSE(control!$C$4,data!I22,data!I54)),\"\",CHOOSE(control!$C$4,data!I22,data!I54))","v":""},{"$f":"IF(ISBLANK(CHOOSE(control!$C$4,data!J22,data!J54)),\"\",CHOOSE(control!$C$4,data!J22,data!J54))","v":""},{"$f":"IF(ISBLANK(CHOOSE(control!$C$4,data!K22,data!K54)),\"\",CHOOSE(control!$C$4,data!K22,data!K54))","v":""},{"$f":"IF(ISBLANK(CHOOSE(control!$C$4,data!L22,data!L54)),\"\",CHOOSE(control!$C$4,data!L22,data!L54))","v":""},{"$f":"IF(ISBLANK(CHOOSE(control!$C$4,data!M22,data!M54)),\"\",CHOOSE(control!$C$4,data!M22,data!M54))","v":0.126},{"$f":"IF(ISBLANK(CHOOSE(control!$C$4,data!N22,data!N54)),\"\",CHOOSE(control!$C$4,data!N22,data!N54))","v":0.13300000000000001},{"$f":"IF(ISBLANK(CHOOSE(control!$C$4,data!O22,data!O54)),\"\",CHOOSE(control!$C$4,data!O22,data!O54))","v":0.122},{"$f":"IF(ISBLANK(CHOOSE(control!$C$4,data!P22,data!P54)),\"\",CHOOSE(control!$C$4,data!P22,data!P54))","v":0.114},{"$f":"IF(ISBLANK(CHOOSE(control!$C$4,data!Q22,data!Q54)),\"\",CHOOSE(control!$C$4,data!Q22,data!Q54))","v":0.106},{"$f":"IF(ISBLANK(CHOOSE(control!$C$4,data!R22,data!R54)),\"\",CHOOSE(control!$C$4,data!R22,data!R54))","v":0.106},{"$f":"IF(ISBLANK(CHOOSE(control!$C$4,data!S22,data!S54)),\"\",CHOOSE(control!$C$4,data!S22,data!S54))","v":9.3000000000000013E-2},{"$f":"IF(ISBLANK(CHOOSE(control!$C$4,data!T22,data!T54)),\"\",CHOOSE(control!$C$4,data!T22,data!T54))","v":6.0999999999999999E-2},{"$f":"IF(ISBLANK(CHOOSE(control!$C$4,data!U22,data!U54)),\"\",CHOOSE(control!$C$4,data!U22,data!U54))","v":5.4000000000000006E-2},{"$f":"IF(ISBLANK(CHOOSE(control!$C$4,data!V22,data!V54)),\"\",CHOOSE(control!$C$4,data!V22,data!V54))","v":6.9000000000000006E-2},{"$f":"IF(ISBLANK(CHOOSE(control!$C$4,data!W22,data!W54)),\"\",CHOOSE(control!$C$4,data!W22,data!W54))","v":0.154},{"$f":"IF(ISBLANK(CHOOSE(control!$C$4,data!X22,data!X54)),\"\",CHOOSE(control!$C$4,data!X22,data!X54))","v":0.17399999999999999},{"$f":"IF(ISBLANK(CHOOSE(control!$C$4,data!Y22,data!Y54)),\"\",CHOOSE(control!$C$4,data!Y22,data!Y54))","v":0.14599999999999999},{"$f":"IF(ISBLANK(CHOOSE(control!$C$4,data!Z22,data!Z54)),\"\",CHOOSE(control!$C$4,data!Z22,data!Z54))","v":0.13600000000000001},{"$f":"IF(ISBLANK(CHOOSE(control!$C$4,data!AA22,data!AA54)),\"\",CHOOSE(control!$C$4,data!AA22,data!AA54))","v":0.107},{"$f":"IF(ISBLANK(CHOOSE(control!$C$4,data!AB22,data!AB54)),\"\",CHOOSE(control!$C$4,data!AB22,data!AB54))","v":0.1}]
[null,null,{"$f":"data!B23","v":"Lithuania"},{"$f":"IF(ISBLANK(CHOOSE(control!$C$4,data!D23,data!D55)),\"\",CHOOSE(control!$C$4,data!D23,data!D55))","v":""},{"$f":"IF(ISBLANK(CHOOSE(control!$C$4,data!E23,data!E55)),\"\",CHOOSE(control!$C$4,data!E23,data!E55))","v":""},{"$f":"IF(ISBLANK(CHOOSE(control!$C$4,data!F23,data!F55)),\"\",CHOOSE(control!$C$4,data!F23,data!F55))","v":""},{"$f":"IF(ISBLANK(CHOOSE(control!$C$4,data!G23,data!G55)),\"\",CHOOSE(control!$C$4,data!G23,data!G55))","v":""},{"$f":"IF(ISBLANK(CHOOSE(control!$C$4,data!H23,data!H55)),\"\",CHOOSE(control!$C$4,data!H23,data!H55))","v":""},{"$f":"IF(ISBLANK(CHOOSE(control!$C$4,data!I23,data!I55)),\"\",CHOOSE(control!$C$4,data!I23,data!I55))","v":""},{"$f":"IF(ISBLANK(CHOOSE(control!$C$4,data!J23,data!J55)),\"\",CHOOSE(control!$C$4,data!J23,data!J55))","v":""},{"$f":"IF(ISBLANK(CHOOSE(control!$C$4,data!K23,data!K55)),\"\",CHOOSE(control!$C$4,data!K23,data!K55))","v":""},{"$f":"IF(ISBLANK(CHOOSE(control!$C$4,data!L23,data!L55)),\"\",CHOOSE(control!$C$4,data!L23,data!L55))","v":0.11900000000000001},{"$f":"IF(ISBLANK(CHOOSE(control!$C$4,data!M23,data!M55)),\"\",CHOOSE(control!$C$4,data!M23,data!M55))","v":0.129},{"$f":"IF(ISBLANK(CHOOSE(control!$C$4,data!N23,data!N55)),\"\",CHOOSE(control!$C$4,data!N23,data!N55))","v":0.14800000000000002},{"$f":"IF(ISBLANK(CHOOSE(control!$C$4,data!O23,data!O55)),\"\",CHOOSE(control!$C$4,data!O23,data!O55))","v":0.159},{"$f":"IF(ISBLANK(CHOOSE(control!$C$4,data!P23,data!P55)),\"\",CHOOSE(control!$C$4,data!P23,data!P55))","v":0.128},{"$f":"IF(ISBLANK(CHOOSE(control!$C$4,data!Q23,data!Q55)),\"\",CHOOSE(control!$C$4,data!Q23,data!Q55))","v":0.111},{"$f":"IF(ISBLANK(CHOOSE(control!$C$4,data!R23,data!R55)),\"\",CHOOSE(control!$C$4,data!R23,data!R55))","v":9.9000000000000005E-2},{"$f":"IF(ISBLANK(CHOOSE(control!$C$4,data!S23,data!S55)),\"\",CHOOSE(control!$C$4,data!S23,data!S55))","v":7.6999999999999999E-2},{"$f":"IF(ISBLANK(CHOOSE(control!$C$4,data!T23,data!T55)),\"\",CHOOSE(control!$C$4,data!T23,data!T55))","v":5.4000000000000006E-2},{"$f":"IF(ISBLANK(CHOOSE(control!$C$4,data!U23,data!U55)),\"\",CHOOSE(control!$C$4,data!U23,data!U55))","v":3.9E-2},{"$f":"IF(ISBLANK(CHOOSE(control!$C$4,data!V23,data!V55)),\"\",CHOOSE(control!$C$4,data!V23,data!V55))","v":0.05},{"$f":"IF(ISBLANK(CHOOSE(control!$C$4,data!W23,data!W55)),\"\",CHOOSE(control!$C$4,data!W23,data!W55))","v":0.122},{"$f":"IF(ISBLANK(CHOOSE(control!$C$4,data!X23,data!X55)),\"\",CHOOSE(control!$C$4,data!X23,data!X55))","v":0.161},{"$f":"IF(ISBLANK(CHOOSE(control!$C$4,data!Y23,data!Y55)),\"\",CHOOSE(control!$C$4,data!Y23,data!Y55))","v":0.13900000000000001},{"$f":"IF(ISBLANK(CHOOSE(control!$C$4,data!Z23,data!Z55)),\"\",CHOOSE(control!$C$4,data!Z23,data!Z55))","v":0.122},{"$f":"IF(ISBLANK(CHOOSE(control!$C$4,data!AA23,data!AA55)),\"\",CHOOSE(control!$C$4,data!AA23,data!AA55))","v":0.109},{"$f":"IF(ISBLANK(CHOOSE(control!$C$4,data!AB23,data!AB55)),\"\",CHOOSE(control!$C$4,data!AB23,data!AB55))","v":9.9000000000000005E-2}]
[null,null,{"$f":"data!B24","v":"Luxembourg"},{"$f":"IF(ISBLANK(CHOOSE(control!$C$4,data!D24,data!D56)),\"\",CHOOSE(control!$C$4,data!D24,data!D56))","v":1.3000000000000001E-2},{"$f":"IF(ISBLANK(CHOOSE(control!$C$4,data!E24,data!E56)),\"\",CHOOSE(control!$C$4,data!E24,data!E56))","v":1.3999999999999999E-2},{"$f":"IF(ISBLANK(CHOOSE(control!$C$4,data!F24,data!F56)),\"\",CHOOSE(control!$C$4,data!F24,data!F56))","v":1.8000000000000002E-2},{"$f":"IF(ISBLANK(CHOOSE(control!$C$4,data!G24,data!G56)),\"\",CHOOSE(control!$C$4,data!G24,data!G56))","v":2.2000000000000002E-2},{"$f":"IF(ISBLANK(CHOOSE(control!$C$4,data!H24,data!H56)),\"\",CHOOSE(control!$C$4,data!H24,data!H56))","v":2.6000000000000002E-2},{"$f":"IF(ISBLANK(CHOOSE(control!$C$4,data!I24,data!I56)),\"\",CHOOSE(control!$C$4,data!I24,data!I56))","v":2.3E-2},{"$f":"IF(ISBLANK(CHOOSE(control!$C$4,data!J24,data!J56)),\"\",CHOOSE(control!$C$4,data!J24,data!J56))","v":2.3E-2},{"$f":"IF(ISBLANK(CHOOSE(control!$C$4,data!K24,data!K56)),\"\",CHOOSE(control!$C$4,data!K24,data!K56))","v":2.1000000000000001E-2},{"$f":"IF(ISBLANK(CHOOSE(control!$C$4,data!L24,data!L56)),\"\",CHOOSE(control!$C$4,data!L24,data!L56))","v":2.2000000000000002E-2},{"$f":"IF(ISBLANK(CHOOSE(control!$C$4,data!M24,data!M56)),\"\",CHOOSE(control!$C$4,data!M24,data!M56))","v":1.9E-2},{"$f":"IF(ISBLANK(CHOOSE(control!$C$4,data!N24,data!N56)),\"\",CHOOSE(control!$C$4,data!N24,data!N56))","v":1.8000000000000002E-2},{"$f":"IF(ISBLANK(CHOOSE(control!$C$4,data!O24,data!O56)),\"\",CHOOSE(control!$C$4,data!O24,data!O56))","v":1.4999999999999999E-2},{"$f":"IF(ISBLANK(CHOOSE(control!$C$4,data!P24,data!P56)),\"\",CHOOSE(control!$C$4,data!P24,data!P56))","v":2.1000000000000001E-2},{"$f":"IF(ISBLANK(CHOOSE(control!$C$4,data!Q24,data!Q56)),\"\",CHOOSE(control!$C$4,data!Q24,data!Q56))","v":3.2000000000000001E-2},{"$f":"IF(ISBLANK(CHOOSE(control!$C$4,data!R24,data!R56)),\"\",CHOOSE(control!$C$4,data!R24,data!R56))","v":4.0999999999999995E-2},{"$f":"IF(ISBLANK(CHOOSE(control!$C$4,data!S24,data!S56)),\"\",CHOOSE(control!$C$4,data!S24,data!S56))","v":3.7999999999999999E-2},{"$f":"IF(ISBLANK(CHOOSE(control!$C$4,data!T24,data!T56)),\"\",CHOOSE(control!$C$4,data!T24,data!T56))","v":3.7999999999999999E-2},{"$f":"IF(ISBLANK(CHOOSE(control!$C$4,data!U24,data!U56)),\"\",CHOOSE(control!$C$4,data!U24,data!U56))","v":3.3000000000000002E-2},{"$f":"IF(ISBLANK(CHOOSE(control!$C$4,data!V24,data!V56)),\"\",CHOOSE(control!$C$4,data!V24,data!V56))","v":3.9E-2},{"$f":"IF(ISBLANK(CHOOSE(control!$C$4,data!W24,data!W56)),\"\",CHOOSE(control!$C$4,data!W24,data!W56))","v":4.0999999999999995E-2},{"$f":"IF(ISBLANK(CHOOSE(control!$C$4,data!X24,data!X56)),\"\",CHOOSE(control!$C$4,data!X24,data!X56))","v":3.7999999999999999E-2},{"$f":"IF(ISBLANK(CHOOSE(control!$C$4,data!Y24,data!Y56)),\"\",CHOOSE(control!$C$4,data!Y24,data!Y56))","v":4.0999999999999995E-2},{"$f":"IF(ISBLANK(CHOOSE(control!$C$4,data!Z24,data!Z56)),\"\",CHOOSE(control!$C$4,data!Z24,data!Z56))","v":4.2000000000000003E-2},{"$f":"IF(ISBLANK(CHOOSE(control!$C$4,data!AA24,data!AA56)),\"\",CHOOSE(control!$C$4,data!AA24,data!AA56))","v":5.0999999999999997E-2},{"$f":"IF(ISBLANK(CHOOSE(control!$C$4,data!AB24,data!AB56)),\"\",CHOOSE(control!$C$4,data!AB24,data!AB56))","v":5.2000000000000005E-2}]
[null,null,{"$f":"data!B25","v":"Malta"},{"$f":"IF(ISBLANK(CHOOSE(control!$C$4,data!D25,data!D57)),\"\",CHOOSE(control!$C$4,data!D25,data!D57))","v":""},{"$f":"IF(ISBLANK(CHOOSE(control!$C$4,data!E25,data!E57)),\"\",CHOOSE(control!$C$4,data!E25,data!E57))","v":""},{"$f":"IF(ISBLANK(CHOOSE(control!$C$4,data!F25,data!F57)),\"\",CHOOSE(control!$C$4,data!F25,data!F57))","v":""},{"$f":"IF(ISBLANK(CHOOSE(control!$C$4,data!G25,data!G57)),\"\",CHOOSE(control!$C$4,data!G25,data!G57))","v":""},{"$f":"IF(ISBLANK(CHOOSE(control!$C$4,data!H25,data!H57)),\"\",CHOOSE(control!$C$4,data!H25,data!H57))","v":""},{"$f":"IF(ISBLANK(CHOOSE(control!$C$4,data!I25,data!I57)),\"\",CHOOSE(control!$C$4,data!I25,data!I57))","v":""},{"$f":"IF(ISBLANK(CHOOSE(control!$C$4,data!J25,data!J57)),\"\",CHOOSE(control!$C$4,data!J25,data!J57))","v":""},{"$f":"IF(ISBLANK(CHOOSE(control!$C$4,data!K25,data!K57)),\"\",CHOOSE(control!$C$4,data!K25,data!K57))","v":""},{"$f":"IF(ISBLANK(CHOOSE(control!$C$4,data!L25,data!L57)),\"\",CHOOSE(control!$C$4,data!L25,data!L57))","v":""},{"$f":"IF(ISBLANK(CHOOSE(control!$C$4,data!M25,data!M57)),\"\",CHOOSE(control!$C$4,data!M25,data!M57))","v":""},{"$f":"IF(ISBLANK(CHOOSE(control!$C$4,data!N25,data!N57)),\"\",CHOOSE(control!$C$4,data!N25,data!N57))","v":4.7E-2},{"$f":"IF(ISBLANK(CHOOSE(control!$C$4,data!O25,data!O57)),\"\",CHOOSE(control!$C$4,data!O25,data!O57))","v":0.04},{"$f":"IF(ISBLANK(CHOOSE(control!$C$4,data!P25,data!P57)),\"\",CHOOSE(control!$C$4,data!P25,data!P57))","v":4.5999999999999999E-2},{"$f":"IF(ISBLANK(CHOOSE(control!$C$4,data!Q25,data!Q57)),\"\",CHOOSE(control!$C$4,data!Q25,data!Q57))","v":5.0999999999999997E-2},{"$f":"IF(ISBLANK(CHOOSE(control!$C$4,data!R25,data!R57)),\"\",CHOOSE(control!$C$4,data!R25,data!R57))","v":4.7E-2},{"$f":"IF(ISBLANK(CHOOSE(control!$C$4,data!S25,data!S57)),\"\",CHOOSE(control!$C$4,data!S25,data!S57))","v":4.7E-2},{"$f":"IF(ISBLANK(CHOOSE(control!$C$4,data!T25,data!T57)),\"\",CHOOSE(control!$C$4,data!T25,data!T57))","v":4.8000000000000001E-2},{"$f":"IF(ISBLANK(CHOOSE(control!$C$4,data!U25,data!U57)),\"\",CHOOSE(control!$C$4,data!U25,data!U57))","v":4.9000000000000002E-2},{"$f":"IF(ISBLANK(CHOOSE(control!$C$4,data!V25,data!V57)),\"\",CHOOSE(control!$C$4,data!V25,data!V57))","v":4.8000000000000001E-2},{"$f":"IF(ISBLANK(CHOOSE(control!$C$4,data!W25,data!W57)),\"\",CHOOSE(control!$C$4,data!W25,data!W57))","v":5.2999999999999999E-2},{"$f":"IF(ISBLANK(CHOOSE(control!$C$4,data!X25,data!X57)),\"\",CHOOSE(control!$C$4,data!X25,data!X57))","v":5.5999999999999994E-2},{"$f":"IF(ISBLANK(CHOOSE(control!$C$4,data!Y25,data!Y57)),\"\",CHOOSE(control!$C$4,data!Y25,data!Y57))","v":0.05},{"$f":"IF(ISBLANK(CHOOSE(control!$C$4,data!Z25,data!Z57)),\"\",CHOOSE(control!$C$4,data!Z25,data!Z57))","v":4.9000000000000002E-2},{"$f":"IF(ISBLANK(CHOOSE(control!$C$4,data!AA25,data!AA57)),\"\",CHOOSE(control!$C$4,data!AA25,data!AA57))","v":5.2000000000000005E-2},{"$f":"IF(ISBLANK(CHOOSE(control!$C$4,data!AB25,data!AB57)),\"\",CHOOSE(control!$C$4,data!AB25,data!AB57))","v":4.7E-2}]
[null,null,{"$f":"data!B26","v":"Netherlands"},{"$f":"IF(ISBLANK(CHOOSE(control!$C$4,data!D26,data!D58)),\"\",CHOOSE(control!$C$4,data!D26,data!D58))","v":5.2999999999999999E-2},{"$f":"IF(ISBLANK(CHOOSE(control!$C$4,data!E26,data!E58)),\"\",CHOOSE(control!$C$4,data!E26,data!E58))","v":4.9000000000000002E-2},{"$f":"IF(ISBLANK(CHOOSE(control!$C$4,data!F26,data!F58)),\"\",CHOOSE(control!$C$4,data!F26,data!F58))","v":5.0999999999999997E-2},{"$f":"IF(ISBLANK(CHOOSE(control!$C$4,data!G26,data!G58)),\"\",CHOOSE(control!$C$4,data!G26,data!G58))","v":5.5999999999999994E-2},{"$f":"IF(ISBLANK(CHOOSE(control!$C$4,data!H26,data!H58)),\"\",CHOOSE(control!$C$4,data!H26,data!H58))","v":6.4000000000000001E-2},{"$f":"IF(ISBLANK(CHOOSE(control!$C$4,data!I26,data!I58)),\"\",CHOOSE(control!$C$4,data!I26,data!I58))","v":6.5000000000000002E-2},{"$f":"IF(ISBLANK(CHOOSE(control!$C$4,data!J26,data!J58)),\"\",CHOOSE(control!$C$4,data!J26,data!J58))","v":0.06},{"$f":"IF(ISBLANK(CHOOSE(control!$C$4,data!K26,data!K58)),\"\",CHOOSE(control!$C$4,data!K26,data!K58))","v":5.2999999999999999E-2},{"$f":"IF(ISBLANK(CHOOSE(control!$C$4,data!L26,data!L58)),\"\",CHOOSE(control!$C$4,data!L26,data!L58))","v":0.04},{"$f":"IF(ISBLANK(CHOOSE(control!$C$4,data!M26,data!M58)),\"\",CHOOSE(control!$C$4,data!M26,data!M58))","v":3.2000000000000001E-2},{"$f":"IF(ISBLANK(CHOOSE(control!$C$4,data!N26,data!N58)),\"\",CHOOSE(control!$C$4,data!N26,data!N58))","v":2.7999999999999997E-2},{"$f":"IF(ISBLANK(CHOOSE(control!$C$4,data!O26,data!O58)),\"\",CHOOSE(control!$C$4,data!O26,data!O58))","v":2.3E-2},{"$f":"IF(ISBLANK(CHOOSE(control!$C$4,data!P26,data!P58)),\"\",CHOOSE(control!$C$4,data!P26,data!P58))","v":2.8999999999999998E-2},{"$f":"IF(ISBLANK(CHOOSE(control!$C$4,data!Q26,data!Q58)),\"\",CHOOSE(control!$C$4,data!Q26,data!Q58))","v":3.9E-2},{"$f":"IF(ISBLANK(CHOOSE(control!$C$4,data!R26,data!R58)),\"\",CHOOSE(control!$C$4,data!R26,data!R58))","v":4.5999999999999999E-2},{"$f":"IF(ISBLANK(CHOOSE(control!$C$4,data!S26,data!S58)),\"\",CHOOSE(control!$C$4,data!S26,data!S58))","v":4.8000000000000001E-2},{"$f":"IF(ISBLANK(CHOOSE(control!$C$4,data!T26,data!T58)),\"\",CHOOSE(control!$C$4,data!T26,data!T58))","v":4.0999999999999995E-2},{"$f":"IF(ISBLANK(CHOOSE(control!$C$4,data!U26,data!U58)),\"\",CHOOSE(control!$C$4,data!U26,data!U58))","v":3.2000000000000001E-2},{"$f":"IF(ISBLANK(CHOOSE(control!$C$4,data!V26,data!V58)),\"\",CHOOSE(control!$C$4,data!V26,data!V58))","v":2.7000000000000003E-2},{"$f":"IF(ISBLANK(CHOOSE(control!$C$4,data!W26,data!W58)),\"\",CHOOSE(control!$C$4,data!W26,data!W58))","v":3.2000000000000001E-2},{"$f":"IF(ISBLANK(CHOOSE(control!$C$4,data!X26,data!X58)),\"\",CHOOSE(control!$C$4,data!X26,data!X58))","v":3.9E-2},{"$f":"IF(ISBLANK(CHOOSE(control!$C$4,data!Y26,data!Y58)),\"\",CHOOSE(control!$C$4,data!Y26,data!Y58))","v":0.04},{"$f":"IF(ISBLANK(CHOOSE(control!$C$4,data!Z26,data!Z58)),\"\",CHOOSE(control!$C$4,data!Z26,data!Z58))","v":4.7E-2},{"$f":"IF(ISBLANK(CHOOSE(control!$C$4,data!AA26,data!AA58)),\"\",CHOOSE(control!$C$4,data!AA26,data!AA58))","v":6.0999999999999999E-2},{"$f":"IF(ISBLANK(CHOOSE(control!$C$4,data!AB26,data!AB58)),\"\",CHOOSE(control!$C$4,data!AB26,data!AB58))","v":6.5000000000000002E-2}]
[null,null,{"$f":"data!B27","v":"Poland"},{"$f":"IF(ISBLANK(CHOOSE(control!$C$4,data!D27,data!D59)),\"\",CHOOSE(control!$C$4,data!D27,data!D59))","v":""},{"$f":"IF(ISBLANK(CHOOSE(control!$C$4,data!E27,data!E59)),\"\",CHOOSE(control!$C$4,data!E27,data!E59))","v":""},{"$f":"IF(ISBLANK(CHOOSE(control!$C$4,data!F27,data!F59)),\"\",CHOOSE(control!$C$4,data!F27,data!F59))","v":""},{"$f":"IF(ISBLANK(CHOOSE(control!$C$4,data!G27,data!G59)),\"\",CHOOSE(control!$C$4,data!G27,data!G59))","v":""},{"$f":"IF(ISBLANK(CHOOSE(control!$C$4,data!H27,data!H59)),\"\",CHOOSE(control!$C$4,data!H27,data!H59))","v":""},{"$f":"IF(ISBLANK(CHOOSE(control!$C$4,data!I27,data!I59)),\"\",CHOOSE(control!$C$4,data!I27,data!I59))","v":""},{"$f":"IF(ISBLANK(CHOOSE(control!$C$4,data!J27,data!J59)),\"\",CHOOSE(control!$C$4,data!J27,data!J59))","v":""},{"$f":"IF(ISBLANK(CHOOSE(control!$C$4,data!K27,data!K59)),\"\",CHOOSE(control!$C$4,data!K27,data!K59))","v":9.3000000000000013E-2},{"$f":"IF(ISBLANK(CHOOSE(control!$C$4,data!L27,data!L59)),\"\",CHOOSE(control!$C$4,data!L27,data!L59))","v":8.5999999999999993E-2},{"$f":"IF(ISBLANK(CHOOSE(control!$C$4,data!M27,data!M59)),\"\",CHOOSE(control!$C$4,data!M27,data!M59))","v":0.111},{"$f":"IF(ISBLANK(CHOOSE(control!$C$4,data!N27,data!N59)),\"\",CHOOSE(control!$C$4,data!N27,data!N59))","v":0.13300000000000001},{"$f":"IF(ISBLANK(CHOOSE(control!$C$4,data!O27,data!O59)),\"\",CHOOSE(control!$C$4,data!O27,data!O59))","v":0.14899999999999999},{"$f":"IF(ISBLANK(CHOOSE(control!$C$4,data!P27,data!P59)),\"\",CHOOSE(control!$C$4,data!P27,data!P59))","v":0.16600000000000001},{"$f":"IF(ISBLANK(CHOOSE(control!$C$4,data!Q27,data!Q59)),\"\",CHOOSE(control!$C$4,data!Q27,data!Q59))","v":0.16399999999999998},{"$f":"IF(ISBLANK(CHOOSE(control!$C$4,data!R27,data!R59)),\"\",CHOOSE(control!$C$4,data!R27,data!R59))","v":0.161},{"$f":"IF(ISBLANK(CHOOSE(control!$C$4,data!S27,data!S59)),\"\",CHOOSE(control!$C$4,data!S27,data!S59))","v":0.152},{"$f":"IF(ISBLANK(CHOOSE(control!$C$4,data!T27,data!T59)),\"\",CHOOSE(control!$C$4,data!T27,data!T59))","v":0.11800000000000001},{"$f":"IF(ISBLANK(CHOOSE(control!$C$4,data!U27,data!U59)),\"\",CHOOSE(control!$C$4,data!U27,data!U59))","v":8.1000000000000003E-2},{"$f":"IF(ISBLANK(CHOOSE(control!$C$4,data!V27,data!V59)),\"\",CHOOSE(control!$C$4,data!V27,data!V59))","v":5.7999999999999996E-2},{"$f":"IF(ISBLANK(CHOOSE(control!$C$4,data!W27,data!W59)),\"\",CHOOSE(control!$C$4,data!W27,data!W59))","v":6.7000000000000004E-2},{"$f":"IF(ISBLANK(CHOOSE(control!$C$4,data!X27,data!X59)),\"\",CHOOSE(control!$C$4,data!X27,data!X59))","v":8.1000000000000003E-2},{"$f":"IF(ISBLANK(CHOOSE(control!$C$4,data!Y27,data!Y59)),\"\",CHOOSE(control!$C$4,data!Y27,data!Y59))","v":0.08},{"$f":"IF(ISBLANK(CHOOSE(control!$C$4,data!Z27,data!Z59)),\"\",CHOOSE(control!$C$4,data!Z27,data!Z59))","v":8.5000000000000006E-2},{"$f":"IF(ISBLANK(CHOOSE(control!$C$4,data!AA27,data!AA59)),\"\",CHOOSE(control!$C$4,data!AA27,data!AA59))","v":8.8000000000000009E-2},{"$f":"IF(ISBLANK(CHOOSE(control!$C$4,data!AB27,data!AB59)),\"\",CHOOSE(control!$C$4,data!AB27,data!AB59))","v":7.6999999999999999E-2}]
[null,null,{"$f":"data!B28","v":"Portugal"},{"$f":"IF(ISBLANK(CHOOSE(control!$C$4,data!D28,data!D60)),\"\",CHOOSE(control!$C$4,data!D28,data!D60))","v":3.7000000000000005E-2},{"$f":"IF(ISBLANK(CHOOSE(control!$C$4,data!E28,data!E60)),\"\",CHOOSE(control!$C$4,data!E28,data!E60))","v":3.4000000000000002E-2},{"$f":"IF(ISBLANK(CHOOSE(control!$C$4,data!F28,data!F60)),\"\",CHOOSE(control!$C$4,data!F28,data!F60))","v":3.2000000000000001E-2},{"$f":"IF(ISBLANK(CHOOSE(control!$C$4,data!G28,data!G60)),\"\",CHOOSE(control!$C$4,data!G28,data!G60))","v":4.4999999999999998E-2},{"$f":"IF(ISBLANK(CHOOSE(control!$C$4,data!H28,data!H60)),\"\",CHOOSE(control!$C$4,data!H28,data!H60))","v":5.7000000000000002E-2},{"$f":"IF(ISBLANK(CHOOSE(control!$C$4,data!I28,data!I60)),\"\",CHOOSE(control!$C$4,data!I28,data!I60))","v":5.9000000000000004E-2},{"$f":"IF(ISBLANK(CHOOSE(control!$C$4,data!J28,data!J60)),\"\",CHOOSE(control!$C$4,data!J28,data!J60))","v":5.9000000000000004E-2},{"$f":"IF(ISBLANK(CHOOSE(control!$C$4,data!K28,data!K60)),\"\",CHOOSE(control!$C$4,data!K28,data!K60))","v":5.7000000000000002E-2},{"$f":"IF(ISBLANK(CHOOSE(control!$C$4,data!L28,data!L60)),\"\",CHOOSE(control!$C$4,data!L28,data!L60))","v":4.7E-2},{"$f":"IF(ISBLANK(CHOOSE(control!$C$4,data!M28,data!M60)),\"\",CHOOSE(control!$C$4,data!M28,data!M60))","v":4.2999999999999997E-2},{"$f":"IF(ISBLANK(CHOOSE(control!$C$4,data!N28,data!N60)),\"\",CHOOSE(control!$C$4,data!N28,data!N60))","v":3.9E-2},{"$f":"IF(ISBLANK(CHOOSE(control!$C$4,data!O28,data!O60)),\"\",CHOOSE(control!$C$4,data!O28,data!O60))","v":3.7999999999999999E-2},{"$f":"IF(ISBLANK(CHOOSE(control!$C$4,data!P28,data!P60)),\"\",CHOOSE(control!$C$4,data!P28,data!P60))","v":4.7E-2},{"$f":"IF(ISBLANK(CHOOSE(control!$C$4,data!Q28,data!Q60)),\"\",CHOOSE(control!$C$4,data!Q28,data!Q60))","v":5.9000000000000004E-2},{"$f":"IF(ISBLANK(CHOOSE(control!$C$4,data!R28,data!R60)),\"\",CHOOSE(control!$C$4,data!R28,data!R60))","v":6.3E-2},{"$f":"IF(ISBLANK(CHOOSE(control!$C$4,data!S28,data!S60)),\"\",CHOOSE(control!$C$4,data!S28,data!S60))","v":7.2999999999999995E-2},{"$f":"IF(ISBLANK(CHOOSE(control!$C$4,data!T28,data!T60)),\"\",CHOOSE(control!$C$4,data!T28,data!T60))","v":7.400000000000001E-2},{"$f":"IF(ISBLANK(CHOOSE(control!$C$4,data!U28,data!U60)),\"\",CHOOSE(control!$C$4,data!U28,data!U60))","v":7.8E-2},{"$f":"IF(ISBLANK(CHOOSE(control!$C$4,data!V28,data!V60)),\"\",CHOOSE(control!$C$4,data!V28,data!V60))","v":7.400000000000001E-2},{"$f":"IF(ISBLANK(CHOOSE(control!$C$4,data!W28,data!W60)),\"\",CHOOSE(control!$C$4,data!W28,data!W60))","v":9.1999999999999998E-2},{"$f":"IF(ISBLANK(CHOOSE(control!$C$4,data!X28,data!X60)),\"\",CHOOSE(control!$C$4,data!X28,data!X60))","v":0.106},{"$f":"IF(ISBLANK(CHOOSE(control!$C$4,data!Y28,data!Y60)),\"\",CHOOSE(control!$C$4,data!Y28,data!Y60))","v":0.113},{"$f":"IF(ISBLANK(CHOOSE(control!$C$4,data!Z28,data!Z60)),\"\",CHOOSE(control!$C$4,data!Z28,data!Z60))","v":0.13900000000000001},{"$f":"IF(ISBLANK(CHOOSE(control!$C$4,data!AA28,data!AA60)),\"\",CHOOSE(control!$C$4,data!AA28,data!AA60))","v":0.14699999999999999},{"$f":"IF(ISBLANK(CHOOSE(control!$C$4,data!AB28,data!AB60)),\"\",CHOOSE(control!$C$4,data!AB28,data!AB60))","v":0.125}]
[null,null,{"$f":"data!B29","v":"Romania"},{"$f":"IF(ISBLANK(CHOOSE(control!$C$4,data!D29,data!D61)),\"\",CHOOSE(control!$C$4,data!D29,data!D61))","v":""},{"$f":"IF(ISBLANK(CHOOSE(control!$C$4,data!E29,data!E61)),\"\",CHOOSE(control!$C$4,data!E29,data!E61))","v":""},{"$f":"IF(ISBLANK(CHOOSE(control!$C$4,data!F29,data!F61)),\"\",CHOOSE(control!$C$4,data!F29,data!F61))","v":""},{"$f":"IF(ISBLANK(CHOOSE(control!$C$4,data!G29,data!G61)),\"\",CHOOSE(control!$C$4,data!G29,data!G61))","v":""},{"$f":"IF(ISBLANK(CHOOSE(control!$C$4,data!H29,data!H61)),\"\",CHOOSE(control!$C$4,data!H29,data!H61))","v":""},{"$f":"IF(ISBLANK(CHOOSE(control!$C$4,data!I29,data!I61)),\"\",CHOOSE(control!$C$4,data!I29,data!I61))","v":""},{"$f":"IF(ISBLANK(CHOOSE(control!$C$4,data!J29,data!J61)),\"\",CHOOSE(control!$C$4,data!J29,data!J61))","v":""},{"$f":"IF(ISBLANK(CHOOSE(control!$C$4,data!K29,data!K61)),\"\",CHOOSE(control!$C$4,data!K29,data!K61))","v":4.4000000000000004E-2},{"$f":"IF(ISBLANK(CHOOSE(control!$C$4,data!L29,data!L61)),\"\",CHOOSE(control!$C$4,data!L29,data!L61))","v":4.7E-2},{"$f":"IF(ISBLANK(CHOOSE(control!$C$4,data!M29,data!M61)),\"\",CHOOSE(control!$C$4,data!M29,data!M61))","v":5.5E-2},{"$f":"IF(ISBLANK(CHOOSE(control!$C$4,data!N29,data!N61)),\"\",CHOOSE(control!$C$4,data!N29,data!N61))","v":6.2E-2},{"$f":"IF(ISBLANK(CHOOSE(control!$C$4,data!O29,data!O61)),\"\",CHOOSE(control!$C$4,data!O29,data!O61))","v":5.9000000000000004E-2},{"$f":"IF(ISBLANK(CHOOSE(control!$C$4,data!P29,data!P61)),\"\",CHOOSE(control!$C$4,data!P29,data!P61))","v":6.5000000000000002E-2},{"$f":"IF(ISBLANK(CHOOSE(control!$C$4,data!Q29,data!Q61)),\"\",CHOOSE(control!$C$4,data!Q29,data!Q61))","v":6.2E-2},{"$f":"IF(ISBLANK(CHOOSE(control!$C$4,data!R29,data!R61)),\"\",CHOOSE(control!$C$4,data!R29,data!R61))","v":6.0999999999999999E-2},{"$f":"IF(ISBLANK(CHOOSE(control!$C$4,data!S29,data!S61)),\"\",CHOOSE(control!$C$4,data!S29,data!S61))","v":5.5999999999999994E-2},{"$f":"IF(ISBLANK(CHOOSE(control!$C$4,data!T29,data!T61)),\"\",CHOOSE(control!$C$4,data!T29,data!T61))","v":5.5999999999999994E-2},{"$f":"IF(ISBLANK(CHOOSE(control!$C$4,data!U29,data!U61)),\"\",CHOOSE(control!$C$4,data!U29,data!U61))","v":4.9000000000000002E-2},{"$f":"IF(ISBLANK(CHOOSE(control!$C$4,data!V29,data!V61)),\"\",CHOOSE(control!$C$4,data!V29,data!V61))","v":4.2999999999999997E-2},{"$f":"IF(ISBLANK(CHOOSE(control!$C$4,data!W29,data!W61)),\"\",CHOOSE(control!$C$4,data!W29,data!W61))","v":5.2000000000000005E-2},{"$f":"IF(ISBLANK(CHOOSE(control!$C$4,data!X29,data!X61)),\"\",CHOOSE(control!$C$4,data!X29,data!X61))","v":5.5999999999999994E-2},{"$f":"IF(ISBLANK(CHOOSE(control!$C$4,data!Y29,data!Y61)),\"\",CHOOSE(control!$C$4,data!Y29,data!Y61))","v":5.7000000000000002E-2},{"$f":"IF(ISBLANK(CHOOSE(control!$C$4,data!Z29,data!Z61)),\"\",CHOOSE(control!$C$4,data!Z29,data!Z61))","v":5.4000000000000006E-2},{"$f":"IF(ISBLANK(CHOOSE(control!$C$4,data!AA29,data!AA61)),\"\",CHOOSE(control!$C$4,data!AA29,data!AA61))","v":5.7000000000000002E-2},{"$f":"IF(ISBLANK(CHOOSE(control!$C$4,data!AB29,data!AB61)),\"\",CHOOSE(control!$C$4,data!AB29,data!AB61))","v":5.5E-2}]
[null,null,{"$f":"data!B30","v":"Slovakia"},{"$f":"IF(ISBLANK(CHOOSE(control!$C$4,data!D30,data!D62)),\"\",CHOOSE(control!$C$4,data!D30,data!D62))","v":""},{"$f":"IF(ISBLANK(CHOOSE(control!$C$4,data!E30,data!E62)),\"\",CHOOSE(control!$C$4,data!E30,data!E62))","v":""},{"$f":"IF(ISBLANK(CHOOSE(control!$C$4,data!F30,data!F62)),\"\",CHOOSE(control!$C$4,data!F30,data!F62))","v":""},{"$f":"IF(ISBLANK(CHOOSE(control!$C$4,data!G30,data!G62)),\"\",CHOOSE(control!$C$4,data!G30,data!G62))","v":""},{"$f":"IF(ISBLANK(CHOOSE(control!$C$4,data!H30,data!H62)),\"\",CHOOSE(control!$C$4,data!H30,data!H62))","v":""},{"$f":"IF(ISBLANK(CHOOSE(control!$C$4,data!I30,data!I62)),\"\",CHOOSE(control!$C$4,data!I30,data!I62))","v":""},{"$f":"IF(ISBLANK(CHOOSE(control!$C$4,data!J30,data!J62)),\"\",CHOOSE(control!$C$4,data!J30,data!J62))","v":""},{"$f":"IF(ISBLANK(CHOOSE(control!$C$4,data!K30,data!K62)),\"\",CHOOSE(control!$C$4,data!K30,data!K62))","v":""},{"$f":"IF(ISBLANK(CHOOSE(control!$C$4,data!L30,data!L62)),\"\",CHOOSE(control!$C$4,data!L30,data!L62))","v":0.10099999999999999},{"$f":"IF(ISBLANK(CHOOSE(control!$C$4,data!M30,data!M62)),\"\",CHOOSE(control!$C$4,data!M30,data!M62))","v":0.129},{"$f":"IF(ISBLANK(CHOOSE(control!$C$4,data!N30,data!N62)),\"\",CHOOSE(control!$C$4,data!N30,data!N62))","v":0.154},{"$f":"IF(ISBLANK(CHOOSE(control!$C$4,data!O30,data!O62)),\"\",CHOOSE(control!$C$4,data!O30,data!O62))","v":0.158},{"$f":"IF(ISBLANK(CHOOSE(control!$C$4,data!P30,data!P62)),\"\",CHOOSE(control!$C$4,data!P30,data!P62))","v":0.154},{"$f":"IF(ISBLANK(CHOOSE(control!$C$4,data!Q30,data!Q62)),\"\",CHOOSE(control!$C$4,data!Q30,data!Q62))","v":0.15},{"$f":"IF(ISBLANK(CHOOSE(control!$C$4,data!R30,data!R62)),\"\",CHOOSE(control!$C$4,data!R30,data!R62))","v":0.161},{"$f":"IF(ISBLANK(CHOOSE(control!$C$4,data!S30,data!S62)),\"\",CHOOSE(control!$C$4,data!S30,data!S62))","v":0.14400000000000002},{"$f":"IF(ISBLANK(CHOOSE(control!$C$4,data!T30,data!T62)),\"\",CHOOSE(control!$C$4,data!T30,data!T62))","v":0.11699999999999999},{"$f":"IF(ISBLANK(CHOOSE(control!$C$4,data!U30,data!U62)),\"\",CHOOSE(control!$C$4,data!U30,data!U62))","v":0.10099999999999999},{"$f":"IF(ISBLANK(CHOOSE(control!$C$4,data!V30,data!V62)),\"\",CHOOSE(control!$C$4,data!V30,data!V62))","v":8.5000000000000006E-2},{"$f":"IF(ISBLANK(CHOOSE(control!$C$4,data!W30,data!W62)),\"\",CHOOSE(control!$C$4,data!W30,data!W62))","v":0.105},{"$f":"IF(ISBLANK(CHOOSE(control!$C$4,data!X30,data!X62)),\"\",CHOOSE(control!$C$4,data!X30,data!X62))","v":0.125},{"$f":"IF(ISBLANK(CHOOSE(control!$C$4,data!Y30,data!Y62)),\"\",CHOOSE(control!$C$4,data!Y30,data!Y62))","v":0.11800000000000001},{"$f":"IF(ISBLANK(CHOOSE(control!$C$4,data!Z30,data!Z62)),\"\",CHOOSE(control!$C$4,data!Z30,data!Z62))","v":0.122},{"$f":"IF(ISBLANK(CHOOSE(control!$C$4,data!AA30,data!AA62)),\"\",CHOOSE(control!$C$4,data!AA30,data!AA62))","v":0.125},{"$f":"IF(ISBLANK(CHOOSE(control!$C$4,data!AB30,data!AB62)),\"\",CHOOSE(control!$C$4,data!AB30,data!AB62))","v":0.11800000000000001}]
[null,null,{"$f":"data!B31","v":"Slovenia"},{"$f":"IF(ISBLANK(CHOOSE(control!$C$4,data!D31,data!D63)),\"\",CHOOSE(control!$C$4,data!D31,data!D63))","v":""},{"$f":"IF(ISBLANK(CHOOSE(control!$C$4,data!E31,data!E63)),\"\",CHOOSE(control!$C$4,data!E31,data!E63))","v":""},{"$f":"IF(ISBLANK(CHOOSE(control!$C$4,data!F31,data!F63)),\"\",CHOOSE(control!$C$4,data!F31,data!F63))","v":""},{"$f":"IF(ISBLANK(CHOOSE(control!$C$4,data!G31,data!G63)),\"\",CHOOSE(control!$C$4,data!G31,data!G63))","v":""},{"$f":"IF(ISBLANK(CHOOSE(control!$C$4,data!H31,data!H63)),\"\",CHOOSE(control!$C$4,data!H31,data!H63))","v":""},{"$f":"IF(ISBLANK(CHOOSE(control!$C$4,data!I31,data!I63)),\"\",CHOOSE(control!$C$4,data!I31,data!I63))","v":""},{"$f":"IF(ISBLANK(CHOOSE(control!$C$4,data!J31,data!J63)),\"\",CHOOSE(control!$C$4,data!J31,data!J63))","v":5.0999999999999997E-2},{"$f":"IF(ISBLANK(CHOOSE(control!$C$4,data!K31,data!K63)),\"\",CHOOSE(control!$C$4,data!K31,data!K63))","v":5.2000000000000005E-2},{"$f":"IF(ISBLANK(CHOOSE(control!$C$4,data!L31,data!L63)),\"\",CHOOSE(control!$C$4,data!L31,data!L63))","v":5.7999999999999996E-2},{"$f":"IF(ISBLANK(CHOOSE(control!$C$4,data!M31,data!M63)),\"\",CHOOSE(control!$C$4,data!M31,data!M63))","v":5.7999999999999996E-2},{"$f":"IF(ISBLANK(CHOOSE(control!$C$4,data!N31,data!N63)),\"\",CHOOSE(control!$C$4,data!N31,data!N63))","v":5.4000000000000006E-2},{"$f":"IF(ISBLANK(CHOOSE(control!$C$4,data!O31,data!O63)),\"\",CHOOSE(control!$C$4,data!O31,data!O63))","v":4.8000000000000001E-2},{"$f":"IF(ISBLANK(CHOOSE(control!$C$4,data!P31,data!P63)),\"\",CHOOSE(control!$C$4,data!P31,data!P63))","v":5.0999999999999997E-2},{"$f":"IF(ISBLANK(CHOOSE(control!$C$4,data!Q31,data!Q63)),\"\",CHOOSE(control!$C$4,data!Q31,data!Q63))","v":5.5E-2},{"$f":"IF(ISBLANK(CHOOSE(control!$C$4,data!R31,data!R63)),\"\",CHOOSE(control!$C$4,data!R31,data!R63))","v":5.0999999999999997E-2},{"$f":"IF(ISBLANK(CHOOSE(control!$C$4,data!S31,data!S63)),\"\",CHOOSE(control!$C$4,data!S31,data!S63))","v":5.4000000000000006E-2},{"$f":"IF(ISBLANK(CHOOSE(control!$C$4,data!T31,data!T63)),\"\",CHOOSE(control!$C$4,data!T31,data!T63))","v":5.0999999999999997E-2},{"$f":"IF(ISBLANK(CHOOSE(control!$C$4,data!U31,data!U63)),\"\",CHOOSE(control!$C$4,data!U31,data!U63))","v":4.2000000000000003E-2},{"$f":"IF(ISBLANK(CHOOSE(control!$C$4,data!V31,data!V63)),\"\",CHOOSE(control!$C$4,data!V31,data!V63))","v":3.7000000000000005E-2},{"$f":"IF(ISBLANK(CHOOSE(control!$C$4,data!W31,data!W63)),\"\",CHOOSE(control!$C$4,data!W31,data!W63))","v":5.0999999999999997E-2},{"$f":"IF(ISBLANK(CHOOSE(control!$C$4,data!X31,data!X63)),\"\",CHOOSE(control!$C$4,data!X31,data!X63))","v":6.5000000000000002E-2},{"$f":"IF(ISBLANK(CHOOSE(control!$C$4,data!Y31,data!Y63)),\"\",CHOOSE(control!$C$4,data!Y31,data!Y63))","v":7.4999999999999997E-2},{"$f":"IF(ISBLANK(CHOOSE(control!$C$4,data!Z31,data!Z63)),\"\",CHOOSE(control!$C$4,data!Z31,data!Z63))","v":7.9000000000000001E-2},{"$f":"IF(ISBLANK(CHOOSE(control!$C$4,data!AA31,data!AA63)),\"\",CHOOSE(control!$C$4,data!AA31,data!AA63))","v":9.1999999999999998E-2},{"$f":"IF(ISBLANK(CHOOSE(control!$C$4,data!AB31,data!AB63)),\"\",CHOOSE(control!$C$4,data!AB31,data!AB63))","v":8.900000000000001E-2}]
[null,null,{"$f":"data!B32","v":"Spain"},{"$f":"IF(ISBLANK(CHOOSE(control!$C$4,data!D32,data!D64)),\"\",CHOOSE(control!$C$4,data!D32,data!D64))","v":0.11699999999999999},{"$f":"IF(ISBLANK(CHOOSE(control!$C$4,data!E32,data!E64)),\"\",CHOOSE(control!$C$4,data!E32,data!E64))","v":0.122},{"$f":"IF(ISBLANK(CHOOSE(control!$C$4,data!F32,data!F64)),\"\",CHOOSE(control!$C$4,data!F32,data!F64))","v":0.13600000000000001},{"$f":"IF(ISBLANK(CHOOSE(control!$C$4,data!G32,data!G64)),\"\",CHOOSE(control!$C$4,data!G32,data!G64))","v":0.16600000000000001},{"$f":"IF(ISBLANK(CHOOSE(control!$C$4,data!H32,data!H64)),\"\",CHOOSE(control!$C$4,data!H32,data!H64))","v":0.17899999999999999},{"$f":"IF(ISBLANK(CHOOSE(control!$C$4,data!I32,data!I64)),\"\",CHOOSE(control!$C$4,data!I32,data!I64))","v":0.17100000000000001},{"$f":"IF(ISBLANK(CHOOSE(control!$C$4,data!J32,data!J64)),\"\",CHOOSE(control!$C$4,data!J32,data!J64))","v":0.16300000000000001},{"$f":"IF(ISBLANK(CHOOSE(control!$C$4,data!K32,data!K64)),\"\",CHOOSE(control!$C$4,data!K32,data!K64))","v":0.153},{"$f":"IF(ISBLANK(CHOOSE(control!$C$4,data!L32,data!L64)),\"\",CHOOSE(control!$C$4,data!L32,data!L64))","v":0.13699999999999998},{"$f":"IF(ISBLANK(CHOOSE(control!$C$4,data!M32,data!M64)),\"\",CHOOSE(control!$C$4,data!M32,data!M64))","v":0.114},{"$f":"IF(ISBLANK(CHOOSE(control!$C$4,data!N32,data!N64)),\"\",CHOOSE(control!$C$4,data!N32,data!N64))","v":0.10099999999999999},{"$f":"IF(ISBLANK(CHOOSE(control!$C$4,data!O32,data!O64)),\"\",CHOOSE(control!$C$4,data!O32,data!O64))","v":8.900000000000001E-2},{"$f":"IF(ISBLANK(CHOOSE(control!$C$4,data!P32,data!P64)),\"\",CHOOSE(control!$C$4,data!P32,data!P64))","v":9.8000000000000004E-2},{"$f":"IF(ISBLANK(CHOOSE(control!$C$4,data!Q32,data!Q64)),\"\",CHOOSE(control!$C$4,data!Q32,data!Q64))","v":9.9000000000000005E-2},{"$f":"IF(ISBLANK(CHOOSE(control!$C$4,data!R32,data!R64)),\"\",CHOOSE(control!$C$4,data!R32,data!R64))","v":9.5000000000000001E-2},{"$f":"IF(ISBLANK(CHOOSE(control!$C$4,data!S32,data!S64)),\"\",CHOOSE(control!$C$4,data!S32,data!S64))","v":7.6999999999999999E-2},{"$f":"IF(ISBLANK(CHOOSE(control!$C$4,data!T32,data!T64)),\"\",CHOOSE(control!$C$4,data!T32,data!T64))","v":7.2000000000000008E-2},{"$f":"IF(ISBLANK(CHOOSE(control!$C$4,data!U32,data!U64)),\"\",CHOOSE(control!$C$4,data!U32,data!U64))","v":7.0000000000000007E-2},{"$f":"IF(ISBLANK(CHOOSE(control!$C$4,data!V32,data!V64)),\"\",CHOOSE(control!$C$4,data!V32,data!V64))","v":9.6999999999999989E-2},{"$f":"IF(ISBLANK(CHOOSE(control!$C$4,data!W32,data!W64)),\"\",CHOOSE(control!$C$4,data!W32,data!W64))","v":0.157},{"$f":"IF(ISBLANK(CHOOSE(control!$C$4,data!X32,data!X64)),\"\",CHOOSE(control!$C$4,data!X32,data!X64))","v":0.17800000000000002},{"$f":"IF(ISBLANK(CHOOSE(control!$C$4,data!Y32,data!Y64)),\"\",CHOOSE(control!$C$4,data!Y32,data!Y64))","v":0.192},{"$f":"IF(ISBLANK(CHOOSE(control!$C$4,data!Z32,data!Z64)),\"\",CHOOSE(control!$C$4,data!Z32,data!Z64))","v":0.22500000000000001},{"$f":"IF(ISBLANK(CHOOSE(control!$C$4,data!AA32,data!AA64)),\"\",CHOOSE(control!$C$4,data!AA32,data!AA64))","v":0.23800000000000002},{"$f":"IF(ISBLANK(CHOOSE(control!$C$4,data!AB32,data!AB64)),\"\",CHOOSE(control!$C$4,data!AB32,data!AB64))","v":0.223}]
[null,null,{"$f":"data!B33","v":"Sweden"},{"$f":"IF(ISBLANK(CHOOSE(control!$C$4,data!D33,data!D65)),\"\",CHOOSE(control!$C$4,data!D33,data!D65))","v":1.2E-2},{"$f":"IF(ISBLANK(CHOOSE(control!$C$4,data!E33,data!E65)),\"\",CHOOSE(control!$C$4,data!E33,data!E65))","v":2.3E-2},{"$f":"IF(ISBLANK(CHOOSE(control!$C$4,data!F33,data!F65)),\"\",CHOOSE(control!$C$4,data!F33,data!F65))","v":4.4000000000000004E-2},{"$f":"IF(ISBLANK(CHOOSE(control!$C$4,data!G33,data!G65)),\"\",CHOOSE(control!$C$4,data!G33,data!G65))","v":7.2000000000000008E-2},{"$f":"IF(ISBLANK(CHOOSE(control!$C$4,data!H33,data!H65)),\"\",CHOOSE(control!$C$4,data!H33,data!H65))","v":7.5999999999999998E-2},{"$f":"IF(ISBLANK(CHOOSE(control!$C$4,data!I33,data!I65)),\"\",CHOOSE(control!$C$4,data!I33,data!I65))","v":7.400000000000001E-2},{"$f":"IF(ISBLANK(CHOOSE(control!$C$4,data!J33,data!J65)),\"\",CHOOSE(control!$C$4,data!J33,data!J65))","v":8.199999999999999E-2},{"$f":"IF(ISBLANK(CHOOSE(control!$C$4,data!K33,data!K65)),\"\",CHOOSE(control!$C$4,data!K33,data!K65))","v":8.5999999999999993E-2},{"$f":"IF(ISBLANK(CHOOSE(control!$C$4,data!L33,data!L65)),\"\",CHOOSE(control!$C$4,data!L33,data!L65))","v":7.2000000000000008E-2},{"$f":"IF(ISBLANK(CHOOSE(control!$C$4,data!M33,data!M65)),\"\",CHOOSE(control!$C$4,data!M33,data!M65))","v":0.06},{"$f":"IF(ISBLANK(CHOOSE(control!$C$4,data!N33,data!N65)),\"\",CHOOSE(control!$C$4,data!N33,data!N65))","v":0.05},{"$f":"IF(ISBLANK(CHOOSE(control!$C$4,data!O33,data!O65)),\"\",CHOOSE(control!$C$4,data!O33,data!O65))","v":4.5999999999999999E-2},{"$f":"IF(ISBLANK(CHOOSE(control!$C$4,data!P33,data!P65)),\"\",CHOOSE(control!$C$4,data!P33,data!P65))","v":4.5999999999999999E-2},{"$f":"IF(ISBLANK(CHOOSE(control!$C$4,data!Q33,data!Q65)),\"\",CHOOSE(control!$C$4,data!Q33,data!Q65))","v":5.2000000000000005E-2},{"$f":"IF(ISBLANK(CHOOSE(control!$C$4,data!R33,data!R65)),\"\",CHOOSE(control!$C$4,data!R33,data!R65))","v":5.7000000000000002E-2},{"$f":"IF(ISBLANK(CHOOSE(control!$C$4,data!S33,data!S65)),\"\",CHOOSE(control!$C$4,data!S33,data!S65))","v":5.7000000000000002E-2},{"$f":"IF(ISBLANK(CHOOSE(control!$C$4,data!T33,data!T65)),\"\",CHOOSE(control!$C$4,data!T33,data!T65))","v":0.05},{"$f":"IF(ISBLANK(CHOOSE(control!$C$4,data!U33,data!U65)),\"\",CHOOSE(control!$C$4,data!U33,data!U65))","v":4.2999999999999997E-2},{"$f":"IF(ISBLANK(CHOOSE(control!$C$4,data!V33,data!V65)),\"\",CHOOSE(control!$C$4,data!V33,data!V65))","v":4.0999999999999995E-2},{"$f":"IF(ISBLANK(CHOOSE(control!$C$4,data!W33,data!W65)),\"\",CHOOSE(control!$C$4,data!W33,data!W65))","v":5.9000000000000004E-2},{"$f":"IF(ISBLANK(CHOOSE(control!$C$4,data!X33,data!X65)),\"\",CHOOSE(control!$C$4,data!X33,data!X65))","v":6.2E-2},{"$f":"IF(ISBLANK(CHOOSE(control!$C$4,data!Y33,data!Y65)),\"\",CHOOSE(control!$C$4,data!Y33,data!Y65))","v":5.5E-2},{"$f":"IF(ISBLANK(CHOOSE(control!$C$4,data!Z33,data!Z65)),\"\",CHOOSE(control!$C$4,data!Z33,data!Z65))","v":5.7000000000000002E-2},{"$f":"IF(ISBLANK(CHOOSE(control!$C$4,data!AA33,data!AA65)),\"\",CHOOSE(control!$C$4,data!AA33,data!AA65))","v":5.7000000000000002E-2},{"$f":"IF(ISBLANK(CHOOSE(control!$C$4,data!AB33,data!AB65)),\"\",CHOOSE(control!$C$4,data!AB33,data!AB65))","v":5.7000000000000002E-2}]
[null,null,{"$f":"data!B34","v":"United Kingdom"},{"$f":"IF(ISBLANK(CHOOSE(control!$C$4,data!D34,data!D66)),\"\",CHOOSE(control!$C$4,data!D34,data!D66))","v":0.06},{"$f":"IF(ISBLANK(CHOOSE(control!$C$4,data!E34,data!E66)),\"\",CHOOSE(control!$C$4,data!E34,data!E66))","v":7.2999999999999995E-2},{"$f":"IF(ISBLANK(CHOOSE(control!$C$4,data!F34,data!F66)),\"\",CHOOSE(control!$C$4,data!F34,data!F66))","v":8.3000000000000004E-2},{"$f":"IF(ISBLANK(CHOOSE(control!$C$4,data!G34,data!G66)),\"\",CHOOSE(control!$C$4,data!G34,data!G66))","v":8.5999999999999993E-2},{"$f":"IF(ISBLANK(CHOOSE(control!$C$4,data!H34,data!H66)),\"\",CHOOSE(control!$C$4,data!H34,data!H66))","v":7.9000000000000001E-2},{"$f":"IF(ISBLANK(CHOOSE(control!$C$4,data!I34,data!I66)),\"\",CHOOSE(control!$C$4,data!I34,data!I66))","v":7.0999999999999994E-2},{"$f":"IF(ISBLANK(CHOOSE(control!$C$4,data!J34,data!J66)),\"\",CHOOSE(control!$C$4,data!J34,data!J66))","v":6.6000000000000003E-2},{"$f":"IF(ISBLANK(CHOOSE(control!$C$4,data!K34,data!K66)),\"\",CHOOSE(control!$C$4,data!K34,data!K66))","v":5.5E-2},{"$f":"IF(ISBLANK(CHOOSE(control!$C$4,data!L34,data!L66)),\"\",CHOOSE(control!$C$4,data!L34,data!L66))","v":4.9000000000000002E-2},{"$f":"IF(ISBLANK(CHOOSE(control!$C$4,data!M34,data!M66)),\"\",CHOOSE(control!$C$4,data!M34,data!M66))","v":4.7E-2},{"$f":"IF(ISBLANK(CHOOSE(control!$C$4,data!N34,data!N66)),\"\",CHOOSE(control!$C$4,data!N34,data!N66))","v":4.2000000000000003E-2},{"$f":"IF(ISBLANK(CHOOSE(control!$C$4,data!O34,data!O66)),\"\",CHOOSE(control!$C$4,data!O34,data!O66))","v":3.7999999999999999E-2},{"$f":"IF(ISBLANK(CHOOSE(control!$C$4,data!P34,data!P66)),\"\",CHOOSE(control!$C$4,data!P34,data!P66))","v":3.9E-2},{"$f":"IF(ISBLANK(CHOOSE(control!$C$4,data!Q34,data!Q66)),\"\",CHOOSE(control!$C$4,data!Q34,data!Q66))","v":3.6000000000000004E-2},{"$f":"IF(ISBLANK(CHOOSE(control!$C$4,data!R34,data!R66)),\"\",CHOOSE(control!$C$4,data!R34,data!R66))","v":3.3000000000000002E-2},{"$f":"IF(ISBLANK(CHOOSE(control!$C$4,data!S34,data!S66)),\"\",CHOOSE(control!$C$4,data!S34,data!S66))","v":3.3000000000000002E-2},{"$f":"IF(ISBLANK(CHOOSE(control!$C$4,data!T34,data!T66)),\"\",CHOOSE(control!$C$4,data!T34,data!T66))","v":3.7999999999999999E-2},{"$f":"IF(ISBLANK(CHOOSE(control!$C$4,data!U34,data!U66)),\"\",CHOOSE(control!$C$4,data!U34,data!U66))","v":3.6000000000000004E-2},{"$f":"IF(ISBLANK(CHOOSE(control!$C$4,data!V34,data!V66)),\"\",CHOOSE(control!$C$4,data!V34,data!V66))","v":3.9E-2},{"$f":"IF(ISBLANK(CHOOSE(control!$C$4,data!W34,data!W66)),\"\",CHOOSE(control!$C$4,data!W34,data!W66))","v":5.5999999999999994E-2},{"$f":"IF(ISBLANK(CHOOSE(control!$C$4,data!X34,data!X66)),\"\",CHOOSE(control!$C$4,data!X34,data!X66))","v":5.7999999999999996E-2},{"$f":"IF(ISBLANK(CHOOSE(control!$C$4,data!Y34,data!Y66)),\"\",CHOOSE(control!$C$4,data!Y34,data!Y66))","v":5.7999999999999996E-2},{"$f":"IF(ISBLANK(CHOOSE(control!$C$4,data!Z34,data!Z66)),\"\",CHOOSE(control!$C$4,data!Z34,data!Z66))","v":5.7000000000000002E-2},{"$f":"IF(ISBLANK(CHOOSE(control!$C$4,data!AA34,data!AA66)),\"\",CHOOSE(control!$C$4,data!AA34,data!AA66))","v":5.4000000000000006E-2},{"$f":"IF(ISBLANK(CHOOSE(control!$C$4,data!AB34,data!AB66)),\"\",CHOOSE(control!$C$4,data!AB34,data!AB66))","v":4.4000000000000004E-2}]
[]
[null,"Current selections"]
[]
[null,null,"Selected country",{"$f":"INDEX($C$7:$C$34,control!$C$8,1)","v":"Germany"}]
[null,null,"Shape name",{"$f":"INDEX(myShapeNames,control!$C$8,1)","v":"S_DEU"}]
[null,null,"Selected year",{"$f":"INDEX($D$6:$AB$6,1,mySelectedYear)","v":"2009-01-01"}]
[]
[null,"Sorted Bar Chart"]
[]
[null,"#","Country",{"$f":"$D$40","v":"2009-01-01"},{"$f":"$D$40","v":"2009-01-01"},"Sort Dummy","Sort Pos","Sort Country","Sort Value","Selected","Others"]
[null,1,{"$f":"C7","v":"Austria"},{"$f":"INDEX($D7:$AB7,1,mySelectedYear)","v":4.4000000000000004E-2},{"$f":"IF(D45=\"\",0,D45)","v":4.4000000000000004E-2},{"$f":"E45+B45/100000000","v":4.4000010000000006E-2},{"$f":"MATCH(LARGE($F$45:$F$72,B45),$F$45:$F$72,0)","v":26},{"$f":"INDEX($C$45:$C$72,$G45,1)","v":"Spain"},{"$f":"INDEX($E$45:$E$72,$G45,1)","v":0.157},{"$f":"IF($H45=$D$38,$I45,0)","v":0},{"$f":"IF($H45<>$D$38,$I45,0)","v":0.157}]
[null,2,"Belgium",6.6000000000000003E-2,{"$f":"IF(D46=\"\",0,D46)","v":6.6000000000000003E-2},6.6000020000000006E-2,16,{"$f":"INDEX($C$45:$C$72,G46,1)","v":"Latvia"},0.154,0,0.154]
[null,3,"Bulgaria",6.0999999999999999E-2,6.0999999999999999E-2,6.1000029999999997E-2,17,"Lithuania",0.122,0,0.122]
[null,4,"Croatia",7.4999999999999997E-2,7.4999999999999997E-2,7.5000040000000004E-2,8,"Estonia",0.11900000000000001,0,0.11900000000000001]
[null,5,"Cyprus",4.4000000000000004E-2,4.4000000000000004E-2,4.4000050000000006E-2,24,"Slovakia",0.105,0,0.105]
[null,6,"Czech Republic",5.7999999999999996E-2,5.7999999999999996E-2,5.8000059999999999E-2,14,"Ireland",0.10099999999999999,0,0.10099999999999999]
[null,7,"Denmark",4.9000000000000002E-2,4.9000000000000002E-2,4.900007E-2,22,"Portugal",9.1999999999999998E-2,0,9.1999999999999998E-2]
[null,8,"Estonia",0.11900000000000001,0.11900000000000001,0.11900008000000001,13,"Hungary",8.8000000000000009E-2,0,8.8000000000000009E-2]
[null,9,"Finland",6.4000000000000001E-2,6.4000000000000001E-2,6.4000089999999996E-2,12,"Greece",8.4000000000000005E-2,0,8.4000000000000005E-2]
[null,10,"France",7.400000000000001E-2,7.400000000000001E-2,7.4000100000000013E-2,4,"Croatia",7.4999999999999997E-2,0,7.4999999999999997E-2]
[null,11,"Germany",7.2000000000000008E-2,7.2000000000000008E-2,7.2000110000000006E-2,10,"France",7.400000000000001E-2,0,7.400000000000001E-2]
[null,12,"Greece",8.4000000000000005E-2,8.4000000000000005E-2,8.4000120000000011E-2,11,"Germany",7.2000000000000008E-2,7.2000000000000008E-2,0]
[null,13,"Hungary",8.8000000000000009E-2,8.8000000000000009E-2,8.800013000000001E-2,21,"Poland",6.7000000000000004E-2,0,6.7000000000000004E-2]
[null,14,"Ireland",0.10099999999999999,0.10099999999999999,0.10100013999999999,2,"Belgium",6.6000000000000003E-2,0,6.6000000000000003E-2]
[null,15,"Italy",6.4000000000000001E-2,6.4000000000000001E-2,6.4000150000000006E-2,15,"Italy",6.4000000000000001E-2,0,6.4000000000000001E-2]
[null,16,"Latvia",0.154,0.154,0.15400016,9,"Finland",6.4000000000000001E-2,0,6.4000000000000001E-2]
[null,17,"Lithuania",0.122,0.122,0.12200016999999999,3,"Bulgaria",6.0999999999999999E-2,0,6.0999999999999999E-2]
[null,18,"Luxembourg",4.0999999999999995E-2,4.0999999999999995E-2,4.1000179999999997E-2,27,"Sweden",5.9000000000000004E-2,0,5.9000000000000004E-2]
[null,19,"Malta",5.2999999999999999E-2,5.2999999999999999E-2,5.3000189999999996E-2,6,"Czech Republic",5.7999999999999996E-2,0,5.7999999999999996E-2]
[null,20,"Netherlands",3.2000000000000001E-2,3.2000000000000001E-2,3.2000199999999999E-2,28,"United Kingdom",5.5999999999999994E-2,0,5.5999999999999994E-2]
[null,21,"Poland",6.7000000000000004E-2,6.7000000000000004E-2,6.7000210000000004E-2,19,"Malta",5.2999999999999999E-2,0,5.2999999999999999E-2]
[null,22,"Portugal",9.1999999999999998E-2,9.1999999999999998E-2,9.2000219999999994E-2,23,"Romania",5.2000000000000005E-2,0,5.2000000000000005E-2]
[null,23,"Romania",5.2000000000000005E-2,5.2000000000000005E-2,5.2000230000000001E-2,25,"Slovenia",5.0999999999999997E-2,0,5.0999999999999997E-2]
[null,24,"Slovakia",0.105,0.105,0.10500023999999999,7,"Denmark",4.9000000000000002E-2,0,4.9000000000000002E-2]
[null,25,"Slovenia",5.0999999999999997E-2,5.0999999999999997E-2,5.1000249999999997E-2,5,"Cyprus",4.4000000000000004E-2,0,4.4000000000000004E-2]
[null,26,"Spain",0.157,0.157,0.15700026,1,"Austria",4.4000000000000004E-2,0,4.4000000000000004E-2]
[null,27,"Sweden",5.9000000000000004E-2,5.9000000000000004E-2,5.900027E-2,18,"Luxembourg",4.0999999999999995E-2,0,4.0999999999999995E-2]
[null,28,"United Kingdom",5.5999999999999994E-2,5.5999999999999994E-2,5.6000279999999993E-2,20,"Netherlands",3.2000000000000001E-2,0,3.2000000000000001E-2]
[]
[null,"Band Chart"]
[]
[null,null,"Country",{"$f":"D6","v":"1990-01-01"},"1991-01-01","1992-01-01","1993-01-01","1994-01-01","1995-01-01","1996-01-01","1997-01-01","1998-01-01","1999-01-01","2000-01-01","2001-01-01","2002-01-01","2003-01-01","2004-01-01","2005-01-01","2006-01-01","2007-01-01","2008-01-01","2009-01-01","2010-01-01","2011-01-01","2012-01-01","2013-01-01","2014-01-01"]
[null,null,{"$f":"$D$38","v":"Germany"},{"$f":"IF(INDEX(D$7:D$34,mySelectedCountry,1)=\"\",NA(),INDEX(D$7:D$34,mySelectedCountry,1))","v":{"$error":"#N/A"}},5.5E-2,6.6000000000000003E-2,7.6999999999999999E-2,8.4000000000000005E-2,8.1000000000000003E-2,8.8000000000000009E-2,9.5000000000000001E-2,9.3000000000000013E-2,8.5000000000000006E-2,7.9000000000000001E-2,7.6999999999999999E-2,8.5000000000000006E-2,9.5000000000000001E-2,0.1,0.106,9.6999999999999989E-2,8.1000000000000003E-2,7.0000000000000007E-2,7.2000000000000008E-2,6.6000000000000003E-2,5.5E-2,5.0999999999999997E-2,4.9000000000000002E-2,4.7E-2]
[null,null,"Min",{"$f":"MIN(D$7:D$34)","v":1.2E-2},1.3999999999999999E-2,1.8000000000000002E-2,2.2000000000000002E-2,2.6000000000000002E-2,2.3E-2,2.3E-2,2.1000000000000001E-2,2.2000000000000002E-2,1.9E-2,1.8000000000000002E-2,1.4999999999999999E-2,2.1000000000000001E-2,3.2000000000000001E-2,3.3000000000000002E-2,3.3000000000000002E-2,3.2000000000000001E-2,3.2000000000000001E-2,2.6000000000000002E-2,3.2000000000000001E-2,3.7999999999999999E-2,3.9E-2,4.2000000000000003E-2,4.7E-2,4.4000000000000004E-2]
[null,null,"Max",{"$f":"MAX(D$7:D$34)","v":0.11699999999999999},0.126,0.13600000000000001,0.16600000000000001,0.17899999999999999,0.17100000000000001,0.16300000000000001,0.153,0.13699999999999998,0.129,0.154,0.17199999999999999,0.16600000000000001,0.16399999999999998,0.161,0.152,0.11800000000000001,0.10099999999999999,9.6999999999999989E-2,0.157,0.17800000000000002,0.192,0.22500000000000001,0.254,0.248]
[null,null,"Average (unweighted)",{"$f":"AVERAGE(D$7:D$34)","v":5.4545454545454557E-2},6.0416666666666667E-2,6.9769230769230778E-2,7.9857142857142877E-2,7.9466666666666658E-2,7.6066666666666671E-2,7.429411764705883E-2,7.031578947368422E-2,7.0818181818181822E-2,7.221739130434783E-2,7.6035714285714276E-2,7.3714285714285704E-2,7.3928571428571427E-2,7.3928571428571427E-2,7.4749999999999983E-2,7.0642857142857132E-2,6.2821428571428584E-2,5.4750000000000007E-2,5.2999999999999999E-2,7.514285714285715E-2,8.6964285714285702E-2,8.6678571428571452E-2,9.3321428571428541E-2,9.685714285714285E-2,9.318518518518519E-2]
[null,null,"Range",{"$f":"D79-D78","v":0.105},{"$f":"E79-E78","v":0.112},0.11800000000000001,0.14400000000000002,0.153,0.14800000000000002,0.14000000000000001,0.13200000000000001,0.11499999999999998,0.11,0.13600000000000001,0.15699999999999997,0.14500000000000002,0.13199999999999998,0.128,0.11899999999999999,8.6000000000000007E-2,6.8999999999999992E-2,7.099999999999998E-2,0.125,0.14000000000000001,0.153,0.183,0.20700000000000002,0.20399999999999999]
[null,null,"Selected Year",{"$f":"IF(D76=$D$40,$D$83,NA())","v":{"$error":"#N/A"}},{"$error":"#N/A"},{"$error":"#N/A"},{"$error":"#N/A"},{"$error":"#N/A"},{"$error":"#N/A"},{"$error":"#N/A"},{"$error":"#N/A"},{"$error":"#N/A"},{"$error":"#N/A"},{"$error":"#N/A"},{"$error":"#N/A"},{"$error":"#N/A"},{"$error":"#N/A"},{"$error":"#N/A"},{"$error":"#N/A"},{"$error":"#N/A"},{"$error":"#N/A"},{"$error":"#N/A"},0.254,{"$error":"#N/A"},{"$error":"#N/A"},{"$error":"#N/A"},{"$error":"#N/A"},{"$error":"#N/A"}]
[null,null,"Max",{"$f":"MAX(D79:AB79)","v":0.254}]
[]
[null,"Line Chart"]
[]
[null,null,"Country",{"$f":"D6","v":"1990-01-01"},"1991-01-01","1992-01-01","1993-01-01","1994-01-01","1995-01-01","1996-01-01","1997-01-01","1998-01-01","1999-01-01","2000-01-01","2001-01-01","2002-01-01","2003-01-01","2004-01-01","2005-01-01","2006-01-01","2007-01-01","2008-01-01","2009-01-01","2010-01-01","2011-01-01","2012-01-01","2013-01-01","2014-01-01"]
[null,null,{"$f":"C7","v":"Austria"},{"$f":"IF(OR($C88=$D$38,D7=\"\"),NA(),D7)","v":{"$error":"#N/A"}},{"$error":"#N/A"},{"$error":"#N/A"},{"$error":"#N/A"},3.5000000000000003E-2,3.6000000000000004E-2,0.04,0.04,4.2000000000000003E-2,3.7000000000000005E-2,3.4000000000000002E-2,3.3000000000000002E-2,3.7999999999999999E-2,3.7000000000000005E-2,4.7E-2,4.7E-2,4.4999999999999998E-2,4.0999999999999995E-2,3.4000000000000002E-2,4.4000000000000004E-2,4.0999999999999995E-2,3.9E-2,4.2000000000000003E-2,4.7E-2,{"$error":"#N/A"}]
[null,null,"Belgium",{"$f":"IF(OR($C89=$D$38,D8=\"\"),NA(),D8)","v":5.4000000000000006E-2},5.4000000000000006E-2,0.06,7.0999999999999994E-2,8.1000000000000003E-2,8.1000000000000003E-2,8.1000000000000003E-2,7.8E-2,0.08,7.0999999999999994E-2,5.7999999999999996E-2,5.4000000000000006E-2,6.4000000000000001E-2,6.7000000000000004E-2,7.0000000000000007E-2,7.0999999999999994E-2,7.0000000000000007E-2,6.3E-2,5.9000000000000004E-2,6.6000000000000003E-2,7.0000000000000007E-2,0.06,6.4000000000000001E-2,7.0999999999999994E-2,7.2999999999999995E-2]
[null,null,"Bulgaria",{"$f":"IF(OR($C90=$D$38,D9=\"\"),NA(),D9)","v":{"$error":"#N/A"}},{"$error":"#N/A"},{"$error":"#N/A"},{"$error":"#N/A"},{"$error":"#N/A"},{"$error":"#N/A"},{"$error":"#N/A"},{"$error":"#N/A"},{"$error":"#N/A"},{"$error":"#N/A"},0.14499999999999999,0.17199999999999999,0.16200000000000001,0.124,0.10800000000000001,0.09,8.1000000000000003E-2,6.2E-2,0.05,6.0999999999999999E-2,9.3000000000000013E-2,0.10099999999999999,0.11,0.11800000000000001,0.10800000000000001]
[null,null,"Croatia",{"$f":"IF(OR($C91=$D$38,D10=\"\"),NA(),D10)","v":{"$error":"#N/A"}},{"$error":"#N/A"},{"$error":"#N/A"},{"$error":"#N/A"},{"$error":"#N/A"},{"$error":"#N/A"},{"$error":"#N/A"},{"$error":"#N/A"},{"$error":"#N/A"},{"$error":"#N/A"},0.125,0.121,0.121,0.113,0.114,0.105,9.6000000000000002E-2,8.199999999999999E-2,6.9000000000000006E-2,7.4999999999999997E-2,9.5000000000000001E-2,0.11599999999999999,0.13699999999999998,0.14400000000000002,0.14300000000000002]
[null,null,"Cyprus",{"$f":"IF(OR($C92=$D$38,D11=\"\"),NA(),D11)","v":{"$error":"#N/A"}},{"$error":"#N/A"},{"$error":"#N/A"},{"$error":"#N/A"},{"$error":"#N/A"},{"$error":"#N/A"},{"$error":"#N/A"},{"$error":"#N/A"},{"$error":"#N/A"},{"$error":"#N/A"},4.2000000000000003E-2,3.4000000000000002E-2,0.03,3.6000000000000004E-2,0.04,4.2999999999999997E-2,3.9E-2,3.3000000000000002E-2,3.1E-2,4.4000000000000004E-2,5.0999999999999997E-2,6.4000000000000001E-2,0.10199999999999999,0.13600000000000001,0.14000000000000001]
[null,null,"Czech Republic",{"$f":"IF(OR($C93=$D$38,D12=\"\"),NA(),D12)","v":{"$error":"#N/A"}},{"$error":"#N/A"},{"$error":"#N/A"},3.5000000000000003E-2,3.4000000000000002E-2,3.3000000000000002E-2,3.2000000000000001E-2,4.0999999999999995E-2,5.2999999999999999E-2,7.2000000000000008E-2,7.400000000000001E-2,6.9000000000000006E-2,6.2E-2,6.6000000000000003E-2,7.0000000000000007E-2,6.8000000000000005E-2,6.2E-2,4.8000000000000001E-2,3.9E-2,5.7999999999999996E-2,6.4000000000000001E-2,5.9000000000000004E-2,0.06,6.0999999999999999E-2,5.4000000000000006E-2]
[null,null,"Denmark",{"$f":"IF(OR($C94=$D$38,D13=\"\"),NA(),D13)","v":6.4000000000000001E-2},7.2000000000000008E-2,7.9000000000000001E-2,8.900000000000001E-2,7.2000000000000008E-2,6.0999999999999999E-2,5.5999999999999994E-2,4.7E-2,4.4000000000000004E-2,4.4000000000000004E-2,0.04,3.9E-2,4.0999999999999995E-2,4.8000000000000001E-2,5.0999999999999997E-2,4.2000000000000003E-2,3.2000000000000001E-2,3.2000000000000001E-2,2.6000000000000002E-2,4.9000000000000002E-2,6.3E-2,6.3E-2,6.3E-2,5.9000000000000004E-2,5.5E-2]
[null,null,"Estonia",{"$f":"IF(OR($C95=$D$38,D14=\"\"),NA(),D14)","v":{"$error":"#N/A"}},{"$error":"#N/A"},{"$error":"#N/A"},{"$error":"#N/A"},{"$error":"#N/A"},{"$error":"#N/A"},{"$error":"#N/A"},{"$error":"#N/A"},{"$error":"#N/A"},{"$error":"#N/A"},0.13400000000000001,0.11900000000000001,0.105,0.09,8.4000000000000005E-2,7.2000000000000008E-2,5.2000000000000005E-2,3.9E-2,4.5999999999999999E-2,0.11900000000000001,0.14899999999999999,0.11199999999999999,8.900000000000001E-2,7.5999999999999998E-2,6.7000000000000004E-2]
[null,null,"Finland",{"$f":"IF(OR($C96=$D$38,D15=\"\"),NA(),D15)","v":2.1000000000000001E-2},5.0999999999999997E-2,9.6000000000000002E-2,0.14099999999999999,0.14499999999999999,0.13699999999999998,0.13,0.11,9.6999999999999989E-2,8.5999999999999993E-2,8.1000000000000003E-2,7.5999999999999998E-2,7.400000000000001E-2,7.2000000000000008E-2,7.2000000000000008E-2,6.8000000000000005E-2,6.2E-2,5.4000000000000006E-2,4.9000000000000002E-2,6.4000000000000001E-2,6.6000000000000003E-2,6.0999999999999999E-2,6.0999999999999999E-2,6.5000000000000002E-2,7.0000000000000007E-2]
[null,null,"France",{"$f":"IF(OR($C97=$D$38,D16=\"\"),NA(),D16)","v":5.2000000000000005E-2},5.2000000000000005E-2,5.7000000000000002E-2,6.0999999999999999E-2,6.3E-2,6.2E-2,6.3E-2,6.3E-2,6.0999999999999999E-2,0.06,5.2000000000000005E-2,4.8000000000000001E-2,4.7E-2,7.2999999999999995E-2,7.4999999999999997E-2,7.4999999999999997E-2,7.2999999999999995E-2,6.7000000000000004E-2,6.0999999999999999E-2,7.400000000000001E-2,7.6999999999999999E-2,7.6999999999999999E-2,8.199999999999999E-2,8.6999999999999994E-2,8.6999999999999994E-2]
[null,null,"Germany",{"$f":"IF(OR($C98=$D$38,D17=\"\"),NA(),D17)","v":{"$error":"#N/A"}},{"$error":"#N/A"},{"$error":"#N/A"},{"$error":"#N/A"},{"$error":"#N/A"},{"$error":"#N/A"},{"$error":"#N/A"},{"$error":"#N/A"},{"$error":"#N/A"},{"$error":"#N/A"},{"$error":"#N/A"},{"$error":"#N/A"},{"$error":"#N/A"},{"$error":"#N/A"},{"$error":"#N/A"},{"$error":"#N/A"},{"$error":"#N/A"},{"$error":"#N/A"},{"$error":"#N/A"},{"$error":"#N/A"},{"$error":"#N/A"},{"$error":"#N/A"},{"$error":"#N/A"},{"$error":"#N/A"},{"$error":"#N/A"}]
[null,null,"Greece",{"$f":"IF(OR($C99=$D$38,D18=\"\"),NA(),D18)","v":{"$error":"#N/A"}},{"$error":"#N/A"},{"$error":"#N/A"},{"$error":"#N/A"},{"$error":"#N/A"},{"$error":"#N/A"},{"$error":"#N/A"},{"$error":"#N/A"},8.199999999999999E-2,9.0999999999999998E-2,8.6999999999999994E-2,8.5000000000000006E-2,8.4000000000000005E-2,7.9000000000000001E-2,8.8000000000000009E-2,8.4000000000000005E-2,7.4999999999999997E-2,7.2000000000000008E-2,6.6000000000000003E-2,8.4000000000000005E-2,0.11199999999999999,0.159,0.223,0.254,0.248]
[null,null,"Hungary",{"$f":"IF(OR($C100=$D$38,D19=\"\"),NA(),D19)","v":{"$error":"#N/A"}},{"$error":"#N/A"},{"$error":"#N/A"},{"$error":"#N/A"},{"$error":"#N/A"},{"$error":"#N/A"},8.4000000000000005E-2,7.6999999999999999E-2,7.4999999999999997E-2,5.7999999999999996E-2,5.4000000000000006E-2,4.8000000000000001E-2,4.8000000000000001E-2,4.9000000000000002E-2,5.2000000000000005E-2,6.0999999999999999E-2,6.5000000000000002E-2,6.5000000000000002E-2,6.9000000000000006E-2,8.8000000000000009E-2,0.1,9.9000000000000005E-2,9.6999999999999989E-2,8.900000000000001E-2,6.7000000000000004E-2]
[null,null,"Ireland",{"$f":"IF(OR($C101=$D$38,D20=\"\"),NA(),D20)","v":0.11699999999999999},0.126,0.13,0.13100000000000001,0.122,0.106,0.10199999999999999,8.5999999999999993E-2,6.6000000000000003E-2,4.9000000000000002E-2,3.6000000000000004E-2,3.2000000000000001E-2,3.6000000000000004E-2,3.7000000000000005E-2,3.6000000000000004E-2,3.5000000000000003E-2,3.7000000000000005E-2,3.7999999999999999E-2,5.2000000000000005E-2,0.10099999999999999,0.12,0.129,0.129,0.11599999999999999,0.1]
[null,null,"Italy",{"$f":"IF(OR($C102=$D$38,D21=\"\"),NA(),D21)","v":{"$error":"#N/A"}},{"$error":"#N/A"},5.5E-2,6.6000000000000003E-2,7.4999999999999997E-2,8.1000000000000003E-2,8.3000000000000004E-2,8.5000000000000006E-2,8.6999999999999994E-2,8.5000000000000006E-2,7.9000000000000001E-2,7.2999999999999995E-2,6.9000000000000006E-2,6.8000000000000005E-2,6.5000000000000002E-2,6.2E-2,5.5E-2,4.9000000000000002E-2,5.5999999999999994E-2,6.4000000000000001E-2,6.9000000000000006E-2,6.9000000000000006E-2,8.900000000000001E-2,0.10199999999999999,0.106]
[null,null,"Latvia",{"$f":"IF(OR($C103=$D$38,D22=\"\"),NA(),D22)","v":{"$error":"#N/A"}},{"$error":"#N/A"},{"$error":"#N/A"},{"$error":"#N/A"},{"$error":"#N/A"},{"$error":"#N/A"},{"$error":"#N/A"},{"$error":"#N/A"},{"$error":"#N/A"},0.126,0.13300000000000001,0.122,0.114,0.106,0.106,9.3000000000000013E-2,6.0999999999999999E-2,5.4000000000000006E-2,6.9000000000000006E-2,0.154,0.17399999999999999,0.14599999999999999,0.13600000000000001,0.107,0.1]
[null,null,"Lithuania",{"$f":"IF(OR($C104=$D$38,D23=\"\"),NA(),D23)","v":{"$error":"#N/A"}},{"$error":"#N/A"},{"$error":"#N/A"},{"$error":"#N/A"},{"$error":"#N/A"},{"$error":"#N/A"},{"$error":"#N/A"},{"$error":"#N/A"},0.11900000000000001,0.129,0.14800000000000002,0.159,0.128,0.111,9.9000000000000005E-2,7.6999999999999999E-2,5.4000000000000006E-2,3.9E-2,0.05,0.122,0.161,0.13900000000000001,0.122,0.109,9.9000000000000005E-2]
[null,null,"Luxembourg",{"$f":"IF(OR($C105=$D$38,D24=\"\"),NA(),D24)","v":1.3000000000000001E-2},1.3999999999999999E-2,1.8000000000000002E-2,2.2000000000000002E-2,2.6000000000000002E-2,2.3E-2,2.3E-2,2.1000000000000001E-2,2.2000000000000002E-2,1.9E-2,1.8000000000000002E-2,1.4999999999999999E-2,2.1000000000000001E-2,3.2000000000000001E-2,4.0999999999999995E-2,3.7999999999999999E-2,3.7999999999999999E-2,3.3000000000000002E-2,3.9E-2,4.0999999999999995E-2,3.7999999999999999E-2,4.0999999999999995E-2,4.2000000000000003E-2,5.0999999999999997E-2,5.2000000000000005E-2]
[null,null,"Malta",{"$f":"IF(OR($C106=$D$38,D25=\"\"),NA(),D25)","v":{"$error":"#N/A"}},{"$error":"#N/A"},{"$error":"#N/A"},{"$error":"#N/A"},{"$error":"#N/A"},{"$error":"#N/A"},{"$error":"#N/A"},{"$error":"#N/A"},{"$error":"#N/A"},{"$error":"#N/A"},4.7E-2,0.04,4.5999999999999999E-2,5.0999999999999997E-2,4.7E-2,4.7E-2,4.8000000000000001E-2,4.9000000000000002E-2,4.8000000000000001E-2,5.2999999999999999E-2,5.5999999999999994E-2,0.05,4.9000000000000002E-2,5.2000000000000005E-2,4.7E-2]
[null,null,"Netherlands",{"$f":"IF(OR($C107=$D$38,D26=\"\"),NA(),D26)","v":5.2999999999999999E-2},4.9000000000000002E-2,5.0999999999999997E-2,5.5999999999999994E-2,6.4000000000000001E-2,6.5000000000000002E-2,0.06,5.2999999999999999E-2,0.04,3.2000000000000001E-2,2.7999999999999997E-2,2.3E-2,2.8999999999999998E-2,3.9E-2,4.5999999999999999E-2,4.8000000000000001E-2,4.0999999999999995E-2,3.2000000000000001E-2,2.7000000000000003E-2,3.2000000000000001E-2,3.9E-2,0.04,4.7E-2,6.0999999999999999E-2,6.5000000000000002E-2]
[null,null,"Poland",{"$f":"IF(OR($C108=$D$38,D27=\"\"),NA(),D27)","v":{"$error":"#N/A"}},{"$error":"#N/A"},{"$error":"#N/A"},{"$error":"#N/A"},{"$error":"#N/A"},{"$error":"#N/A"},{"$error":"#N/A"},9.3000000000000013E-2,8.5999999999999993E-2,0.111,0.13300000000000001,0.14899999999999999,0.16600000000000001,0.16399999999999998,0.161,0.152,0.11800000000000001,8.1000000000000003E-2,5.7999999999999996E-2,6.7000000000000004E-2,8.1000000000000003E-2,0.08,8.5000000000000006E-2,8.8000000000000009E-2,7.6999999999999999E-2]
[null,null,"Portugal",{"$f":"IF(OR($C109=$D$38,D28=\"\"),NA(),D28)","v":3.7000000000000005E-2},3.4000000000000002E-2,3.2000000000000001E-2,4.4999999999999998E-2,5.7000000000000002E-2,5.9000000000000004E-2,5.9000000000000004E-2,5.7000000000000002E-2,4.7E-2,4.2999999999999997E-2,3.9E-2,3.7999999999999999E-2,4.7E-2,5.9000000000000004E-2,6.3E-2,7.2999999999999995E-2,7.400000000000001E-2,7.8E-2,7.400000000000001E-2,9.1999999999999998E-2,0.106,0.113,0.13900000000000001,0.14699999999999999,0.125]
[null,null,"Romania",{"$f":"IF(OR($C110=$D$38,D29=\"\"),NA(),D29)","v":{"$error":"#N/A"}},{"$error":"#N/A"},{"$error":"#N/A"},{"$error":"#N/A"},{"$error":"#N/A"},{"$error":"#N/A"},{"$error":"#N/A"},4.4000000000000004E-2,4.7E-2,5.5E-2,6.2E-2,5.9000000000000004E-2,6.5000000000000002E-2,6.2E-2,6.0999999999999999E-2,5.5999999999999994E-2,5.5999999999999994E-2,4.9000000000000002E-2,4.2999999999999997E-2,5.2000000000000005E-2,5.5999999999999994E-2,5.7000000000000002E-2,5.4000000000000006E-2,5.7000000000000002E-2,5.5E-2]
[null,null,"Slovakia",{"$f":"IF(OR($C111=$D$38,D30=\"\"),NA(),D30)","v":{"$error":"#N/A"}},{"$error":"#N/A"},{"$error":"#N/A"},{"$error":"#N/A"},{"$error":"#N/A"},{"$error":"#N/A"},{"$error":"#N/A"},{"$error":"#N/A"},0.10099999999999999,0.129,0.154,0.158,0.154,0.15,0.161,0.14400000000000002,0.11699999999999999,0.10099999999999999,8.5000000000000006E-2,0.105,0.125,0.11800000000000001,0.122,0.125,0.11800000000000001]
[null,null,"Slovenia",{"$f":"IF(OR($C112=$D$38,D31=\"\"),NA(),D31)","v":{"$error":"#N/A"}},{"$error":"#N/A"},{"$error":"#N/A"},{"$error":"#N/A"},{"$error":"#N/A"},{"$error":"#N/A"},5.0999999999999997E-2,5.2000000000000005E-2,5.7999999999999996E-2,5.7999999999999996E-2,5.4000000000000006E-2,4.8000000000000001E-2,5.0999999999999997E-2,5.5E-2,5.0999999999999997E-2,5.4000000000000006E-2,5.0999999999999997E-2,4.2000000000000003E-2,3.7000000000000005E-2,5.0999999999999997E-2,6.5000000000000002E-2,7.4999999999999997E-2,7.9000000000000001E-2,9.1999999999999998E-2,8.900000000000001E-2]
[null,null,"Spain",{"$f":"IF(OR($C113=$D$38,D32=\"\"),NA(),D32)","v":0.11699999999999999},0.122,0.13600000000000001,0.16600000000000001,0.17899999999999999,0.17100000000000001,0.16300000000000001,0.153,0.13699999999999998,0.114,0.10099999999999999,8.900000000000001E-2,9.8000000000000004E-2,9.9000000000000005E-2,9.5000000000000001E-2,7.6999999999999999E-2,7.2000000000000008E-2,7.0000000000000007E-2,9.6999999999999989E-2,0.157,0.17800000000000002,0.192,0.22500000000000001,0.23800000000000002,0.223]
[null,null,"Sweden",{"$f":"IF(OR($C114=$D$38,D33=\"\"),NA(),D33)","v":1.2E-2},2.3E-2,4.4000000000000004E-2,7.2000000000000008E-2,7.5999999999999998E-2,7.400000000000001E-2,8.199999999999999E-2,8.5999999999999993E-2,7.2000000000000008E-2,0.06,0.05,4.5999999999999999E-2,4.5999999999999999E-2,5.2000000000000005E-2,5.7000000000000002E-2,5.7000000000000002E-2,0.05,4.2999999999999997E-2,4.0999999999999995E-2,5.9000000000000004E-2,6.2E-2,5.5E-2,5.7000000000000002E-2,5.7000000000000002E-2,5.7000000000000002E-2]
[null,null,"United Kingdom",{"$f":"IF(OR($C115=$D$38,D34=\"\"),NA(),D34)","v":0.06},7.2999999999999995E-2,8.3000000000000004E-2,8.5999999999999993E-2,7.9000000000000001E-2,7.0999999999999994E-2,6.6000000000000003E-2,5.5E-2,4.9000000000000002E-2,4.7E-2,4.2000000000000003E-2,3.7999999999999999E-2,3.9E-2,3.6000000000000004E-2,3.3000000000000002E-2,3.3000000000000002E-2,3.7999999999999999E-2,3.6000000000000004E-2,3.9E-2,5.5999999999999994E-2,5.7999999999999996E-2,5.7999999999999996E-2,5.7000000000000002E-2,5.4000000000000006E-2,4.4000000000000004E-2]
[]
[null,null,"Average (unweighted)",{"$f":"AVERAGE(D7:D34)","v":5.4545454545454557E-2},6.0416666666666667E-2,6.9769230769230778E-2,7.9857142857142877E-2,7.9466666666666658E-2,7.6066666666666671E-2,7.429411764705883E-2,7.031578947368422E-2,7.0818181818181822E-2,7.221739130434783E-2,7.6035714285714276E-2,7.3714285714285704E-2,7.3928571428571427E-2,7.3928571428571427E-2,7.4749999999999983E-2,7.0642857142857132E-2,6.2821428571428584E-2,5.4750000000000007E-2,5.2999999999999999E-2,7.514285714285715E-2,8.6964285714285702E-2,8.6678571428571452E-2,9.3321428571428541E-2,9.685714285714285E-2,9.318518518518519E-2]
[null,null,{"$f":"$D$38","v":"Germany"},{"$f":"IF(INDEX(D$7:D$34,mySelectedCountry,1)=\"\",NA(),INDEX(D$7:D$34,mySelectedCountry,1))","v":{"$error":"#N/A"}},5.5E-2,6.6000000000000003E-2,7.6999999999999999E-2,8.4000000000000005E-2,8.1000000000000003E-2,8.8000000000000009E-2,9.5000000000000001E-2,9.3000000000000013E-2,8.5000000000000006E-2,7.9000000000000001E-2,7.6999999999999999E-2,8.5000000000000006E-2,9.5000000000000001E-2,0.1,0.106,9.6999999999999989E-2,8.1000000000000003E-2,7.0000000000000007E-2,7.2000000000000008E-2,6.6000000000000003E-2,5.5E-2,5.0999999999999997E-2,4.9000000000000002E-2,4.7E-2]
[]
[null,"Scrollable Table"]
[]
[null,null,null,{"$f":"control!$C$39+1","v":16},{"$f":"D122+1","v":17},{"$f":"E122+1","v":18},19,20,{"$f":"H122+1","v":21},{"$f":"I122+1","v":22},{"$f":"J122+1","v":23},{"$f":"K122+1","v":24},25]
[null,"Ndx","Country",{"$f":"INDEX($D$6:$AB$6,1,D122)","v":"2005-01-01"},"2006-01-01","2007-01-01","2008-01-01","2009-01-01","2010-01-01","2011-01-01","2012-01-01","2013-01-01","2014-01-01",null,"Pos"]
[null,{"$f":"control!$C$40+1","v":7},{"$f":"INDEX($C$7:$C$34,$B124,1)","v":"Denmark"},{"$f":"IF(ISBLANK(INDEX($D$7:$AB$34,$B124,D$122)),\"\",INDEX($D$7:$AB$34,$B124,D$122))","v":4.2000000000000003E-2},3.2000000000000001E-2,3.2000000000000001E-2,2.6000000000000002E-2,4.9000000000000002E-2,6.3E-2,6.3E-2,6.3E-2,5.9000000000000004E-2,5.5E-2,null,{"$f":"MATCH(C124,myCountryList,0)","v":7}]
[null,{"$f":"B124+1","v":8},"Estonia",7.2000000000000008E-2,5.2000000000000005E-2,3.9E-2,4.5999999999999999E-2,0.11900000000000001,0.14899999999999999,0.11199999999999999,8.900000000000001E-2,7.5999999999999998E-2,6.7000000000000004E-2,null,8]
[null,{"$f":"B125+1","v":9},"Finland",6.8000000000000005E-2,6.2E-2,5.4000000000000006E-2,4.9000000000000002E-2,6.4000000000000001E-2,6.6000000000000003E-2,6.0999999999999999E-2,6.0999999999999999E-2,6.5000000000000002E-2,7.0000000000000007E-2,null,9]
[null,10,"France",7.4999999999999997E-2,7.2999999999999995E-2,6.7000000000000004E-2,6.0999999999999999E-2,7.400000000000001E-2,7.6999999999999999E-2,7.6999999999999999E-2,8.199999999999999E-2,8.6999999999999994E-2,8.6999999999999994E-2,null,10]
[null,11,"Germany",0.106,9.6999999999999989E-2,8.1000000000000003E-2,7.0000000000000007E-2,7.2000000000000008E-2,6.6000000000000003E-2,5.5E-2,5.0999999999999997E-2,4.9000000000000002E-2,4.7E-2,null,11]
[null,12,"Greece",8.4000000000000005E-2,7.4999999999999997E-2,7.2000000000000008E-2,6.6000000000000003E-2,8.4000000000000005E-2,0.11199999999999999,0.159,0.223,0.254,0.248,null,12]
[null,13,"Hungary",6.0999999999999999E-2,6.5000000000000002E-2,6.5000000000000002E-2,6.9000000000000006E-2,8.8000000000000009E-2,0.1,9.9000000000000005E-2,9.6999999999999989E-2,8.900000000000001E-2,6.7000000000000004E-2,null,13]
[null,14,"Ireland",3.5000000000000003E-2,3.7000000000000005E-2,3.7999999999999999E-2,5.2000000000000005E-2,0.10099999999999999,0.12,0.129,0.129,0.11599999999999999,0.1,null,14]
[null,15,"Italy",6.2E-2,5.5E-2,4.9000000000000002E-2,5.5999999999999994E-2,6.4000000000000001E-2,6.9000000000000006E-2,6.9000000000000006E-2,8.900000000000001E-2,0.10199999999999999,0.106,null,15]
[null,16,"Latvia",9.3000000000000013E-2,6.0999999999999999E-2,5.4000000000000006E-2,6.9000000000000006E-2,0.154,0.17399999999999999,0.14599999999999999,0.13600000000000001,0.107,0.1,null,16]
[]
[null,"Choropleth Map"]
[]
[null,"#","Country Name","Value","Shape Name","Shape Index"]
[null,1,{"$f":"C7","v":"Austria"},{"$f":"IF(ISBLANK(INDEX($D7:$AB7,1,mySelectedYear)),\"\",INDEX($D7:$AB7,1,mySelectedYear))","v":4.4000000000000004E-2},"S_AUT",1]
[null,2,{"$f":"C8","v":"Belgium"},6.6000000000000003E-2,"S_BEL",2]
[null,3,"Bulgaria",6.0999999999999999E-2,"S_BGR",3]
[null,4,"Croatia",7.4999999999999997E-2,"S_HRV",4]
[null,5,"Cyprus",4.4000000000000004E-2,"S_CYP",5]
[null,6,"Czech Republic",5.7999999999999996E-2,"S_CZE",6]
[null,7,"Denmark",4.9000000000000002E-2,"S_DNK",7]
[null,8,"Estonia",0.11900000000000001,"S_EST",8]
[null,9,"Finland",6.4000000000000001E-2,"S_FIN",9]
[null,10,"France",7.400000000000001E-2,"S_FRA",10]
[null,11,"Germany",7.2000000000000008E-2,"S_DEU",11]
[null,12,"Greece",8.4000000000000005E-2,"S_GRC",12]
[null,13,"Hungary",8.8000000000000009E-2,"S_HUN",13]
[null,14,"Ireland",0.10099999999999999,"S_IRL",14]
[null,15,"Italy",6.4000000000000001E-2,"S_ITA",15]
[null,16,"Latvia",0.154,"S_LVA",16]
[null,17,"Lithuania",0.122,"S_LTU",17]
[null,18,"Luxembourg",4.0999999999999995E-2,"S_LUX",18]
[null,19,"Malta",5.2999999999999999E-2,"S_MLT",19]
[null,20,"Netherlands",3.2000000000000001E-2,"S_NLD",20]
[null,21,"Poland",6.7000000000000004E-2,"S_POL",21]
[null,22,"Portugal",9.1999999999999998E-2,"S_PRT",22]
[null,23,"Romania",5.2000000000000005E-2,"S_ROU",23]
[null,24,"Slovakia",0.105,"S_SVK",24]
[null,25,"Slovenia",5.0999999999999997E-2,"S_SVN",25]
[null,26,"Spain",0.157,"S_ESP",26]
[null,27,"Sweden",5.9000000000000004E-2,"S_SWE",27]
[null,28,"United Kingdom",5.5999999999999994E-2,"S_GBR",28]
[]
[null,"Map legend calculations"]
[]
[null,null,"Maximum value",{"$f":"MAX($E$45:$E$72)","v":0.157}]
[null,null,"Step Size",{"$f":"ROUND(D169/$D$181,2)","v":0.02}]
[null,null,"Current country bin",{"$f":"IFERROR(VLOOKUP(INDEX($D$45:$D$72,mySelectedCountry,1),$E$173:$G$181,3,TRUE),control!$E$47)","v":"6% to 8%"}]
[]
[null,null,null,1,0,{"$f":"$D$170","v":0.02},{"$f":"TEXT(E173,\"0%\")&\" to \"&TEXT(F173,\"0%\")","v":"0% to 2%"}]
[null,null,null,2,{"$f":"F173","v":0.02},{"$f":"F173+$D$170","v":0.04},{"$f":"TEXT(E174,\"0%\")&\" to \"&TEXT(F174,\"0%\")","v":"2% to 4%"}]
[null,null,null,3,{"$f":"F174","v":0.04},0.06,"4% to 6%"]
[null,null,null,4,0.06,0.08,"6% to 8%"]
[null,null,null,5,0.08,0.1,"8% to 10%"]
[null,null,null,6,0.1,0.12000000000000001,"10% to 12%"]
[null,null,null,7,0.12000000000000001,0.14000000000000001,"12% to 14%"]
[null,null,null,8,0.14000000000000001,0.16,"14% to 16%"]
[null,null,null,9,0.16,1,{"$f":"TEXT(E181,\"0%\")&\" or more\"","v":"16% or more"}]

{"sheet":"charts","index":4,"n_rows":2,"n_cols":2,"rows_kept":2,"cut":false,"hidden":false,"merged":[]}
[]
[null,"Line and Band Chart"]

{"sheet":"map icon","index":5,"n_rows":2,"n_cols":2,"rows_kept":2,"cut":false,"hidden":false,"merged":[]}
[]
[null,"Map \"Icon\""]