{"text_format":"1","workbook":"xlsx","n_sheets":6,"sheets":["dashboard","data","control","calcs","charts","map icon"],"not_rendered":{"charts":3,"images":4,"macros":1,"external_links":0,"defined_names":19,"comments":0,"pivot_tables":0},"unopened":[],"bounds":{"document_bytes":16777216,"sheet_cells":100000,"rows_first":2000,"rows_last":500,"rows_between":2000,"halvings":0,"cell_chars":16384,"cell_head_chars":4096},"cells_cut":0,"cells_raw":0,"read":"whole","date_system":"1900"}

{"sheet":"dashboard","index":0,"n_rows":41,"n_cols":29,"rows_kept":41,"cut":false,"hidden":false,"merged":[[25,1,25,11],[6,13,6,18],[6,20,6,23],[1,1,3,10],[1,18,3,20],[1,21,3,21]]}
[]
[null,"European Union Unemployment Rates",null,null,null,null,null,null,null,null,null,null,null,null,null,"Country",null,null,{"$f":"calcs!D38","v":"Germany"},null,null,{"$f":"calcs!$D$40","v":"2009-01-01"}]
[null,null,null,null,null,null,null,null,null,null,null,null,null,null,null,"Year",null,null,null,null,null,null,null,null,null,null,null,null,"www.cs-analytics.de"]
[null,null,null,null,null,null,null,null,null,null,null,null,null,null,null,"Age group"]
[]
[]
[null,null,null,"Band Chart",null,null,null,"Line Chart",null,null,null,null,null,{"$f":"\"Sorted Bar Chart (\"&YEAR(calcs!$D$40)&\")\"","v":"Sorted Bar Chart (2009)"},null,null,null,null,null,null,{"$f":"\"Choropleth Map (\"&YEAR(calcs!$D$40)&\")\"","v":"Choropleth Map (2009)"},null,null,null,"Color scale"]
[]
[null,null,null,null,null,null,null,null,null,null,null,null,null,null,null,"click on a country to select",null,null,null,null,"click on a country to select"]
[]
{"$rows_left_out":32}
{"sheet":"data","index":1,"n_rows":66,"n_cols":28,"rows_kept":66,"cut":false,"hidden":false,"merged":[]}
[]
[null,"EU Unemployment Rates by Country",null,null,null,null,null,null,null,null,null,null,null,null,null,null,null,null,null,null,null,"source: EuroStat",null,"http://ec.europa.eu/eurostat/en"]
[]
[null,"Age group 25 to 74"]
[]
[null,"Country",null,"1990-01-01","1991-01-01","1992-01-01","1993-01-01","1994-01-01","1995-01-01","1996-01-01","1997-01-01","1998-01-01","1999-01-01","2000-01-01","2001-01-01","2002-01-01","2003-01-01","2004-01-01","2005-01-01","2006-01-01","2007-01-01","2008-01-01","2009-01-01","2010-01-01","2011-01-01","2012-01-01","2013-01-01","2014-01-01"]
[null,"Austria",null,null,null,null,null,3.5000000000000003E-2,3.6000000000000004E-2,0.04,0.04,4.2000000000000003E-2,3.7000000000000005E-2,3.4000000000000002E-2,3.3000000000000002E-2,3.7999999999999999E-2,3.7000000000000005E-2,4.7E-2,4.7E-2,4.4999999999999998E-2,4.0999999999999995E-2,3.4000000000000002E-2,4.4000000000000004E-2,4.0999999999999995E-2,3.9E-2,4.2000000000000003E-2,4.7E-2]
[null,"Belgium",null,5.4000000000000006E-2,5.4000000000000006E-2,0.06,7.0999999999999994E-2,8.1000000000000003E-2,8.1000000000000003E-2,8.1000000000000003E-2,7.8E-2,0.08,7.0999999999999994E-2,5.7999999999999996E-2,5.4000000000000006E-2,6.4000000000000001E-2,6.7000000000000004E-2,7.0000000000000007E-2,7.0999999999999994E-2,7.0000000000000007E-2,6.3E-2,5.9000000000000004E-2,6.6000000000000003E-2,7.0000000000000007E-2,0.06,6.4000000000000001E-2,7.0999999999999994E-2,7.2999999999999995E-2]
[null,"Bulgaria",null,null,null,null,null,null,null,null,null,null,null,0.14499999999999999,0.17199999999999999,0.16200000000000001,0.124,0.10800000000000001,0.09,8.1000000000000003E-2,6.2E-2,0.05,6.0999999999999999E-2,9.3000000000000013E-2,0.10099999999999999,0.11,0.11800000000000001,0.10800000000000001]
[null,"Croatia",null,null,null,null,null,null,null,null,null,null,null,0.125,0.121,0.121,0.113,0.114,0.105,9.6000000000000002E-2,8.199999999999999E-2,6.9000000000000006E-2,7.4999999999999997E-2,9.5000000000000001E-2,0.11599999999999999,0.13699999999999998,0.14400000000000002,0.14300000000000002]
{"$rows_left_out":57}
{"sheet":"control","index":2,"n_rows":82,"n_cols":28,"rows_kept":82,"cut":false,"hidden":false,"merged":[]}
[]
[null,"Control"]
[]
[null,"Selection age group",1]
[null,"Age group","25 to 74"]
[null,null,"Less than 25"]
[]
[null,"Selection country",11]
[]
[null,"Selection year",20]
{"$rows_left_out":73}
{"sheet":"calcs","index":3,"n_rows":181,"n_cols":28,"rows_kept":181,"cut":false,"hidden":false,"merged":[]}
[]
[null,"Calculations"]
[]
[null,"Age group data"]
[]
[null,null,"Country",{"$f":"data!D6","v":"1990-01-01"},{"$f":"data!E6","v":"1991-01-01"},{"$f":"data!F6","v":"1992-01-01"},{"$f":"data!G6","v":"1993-01-01"},{"$f":"data!H6","v":"1994-01-01"},{"$f":"data!I6","v":"1995-01-01"},{"$f":"data!J6","v":"1996-01-01"},{"$f":"data!K6","v":"1997-01-01"},{"$f":"data!L6","v":"1998-01-01"},{"$f":"data!M6","v":"1999-01-01"},{"$f":"data!N6","v":"2000-01-01"},{"$f":"data!O6","v":"2001-01-01"},{"$f":"data!P6","v":"2002-01-01"},{"$f":"data!Q6","v":"2003-01-01"},{"$f":"data!R6","v":"2004-01-01"},{"$f":"data!S6","v":"2005-01-01"},{"$f":"data!T6","v":"2006-01-01"},{"$f":"data!U6","v":"2007-01-01"},{"$f":"data!V6","v":"2008-01-01"},{"$f":"data!W6","v":"2009-01-01"},{"$f":"data!X6","v":"2010-01-01"},{"$f":"data!Y6","v":"2011-01-01"},{"$f":"data!Z6","v":"2012-01-01"},{"$f":"data!AA6","v":"2013-01-01"},{"$f":"data!AB6","v":"2014-01-01"}]
[null,null,{"$f":"data!B7","v":"Austria"},{"$f":"IF(ISBLANK(CHOOSE(control!$C$4,data!D7,data!D39)),\"\",CHOOSE(control!$C$4,data!D7,data!D39))","v":""},{"$f":"IF(ISBLANK(CHOOSE(control!$C$4,data!E7,data!E39)),\"\",CHOOSE(control!$C$4,data!E7,data!E39))","v":""},{"$f":"IF(ISBLANK(CHOOSE(control!$C$4,data!F7,data!F39)),\"\",CHOOSE(control!$C$4,data!F7,data!F39))","v":""},{"$f":"IF(ISBLANK(CHOOSE(control!$C$4,data!G7,data!G39)),\"\",CHOOSE(control!$C$4,data!G7,data!G39))","v":""},{"$f":"IF(ISBLANK(CHOOSE(control!$C$4,data!H7,data!H39)),\"\",CHOOSE(control!$C$4,data!H7,data!H39))","v":3.5000000000000003E-2},{"$f":"IF(ISBLANK(CHOOSE(control!$C$4,data!I7,data!I39)),\"\",CHOOSE(control!$C$4,data!I7,data!I39))","v":3.6000000000000004E-2},{"$f":"IF(ISBLANK(CHOOSE(control!$C$4,data!J7,data!J39)),\"\",CHOOSE(control!$C$4,data!J7,data!J39))","v":0.04},{"$f":"IF(ISBLANK(CHOOSE(control!$C$4,data!K7,data!K39)),\"\",CHOOSE(control!$C$4,data!K7,data!K39))","v":0.04},{"$f":"IF(ISBLANK(CHOOSE(control!$C$4,data!L7,data!L39)),\"\",CHOOSE(control!$C$4,data!L7,data!L39))","v":4.2000000000000003E-2},{"$f":"IF(ISBLANK(CHOOSE(control!$C$4,data!M7,data!M39)),\"\",CHOOSE(control!$C$4,data!M7,data!M39))","v":3.7000000000000005E-2},{"$f":"IF(ISBLANK(CHOOSE(control!$C$4,data!N7,data!N39)),\"\",CHOOSE(control!$C$4,data!N7,data!N39))","v":3.4000000000000002E-2},{"$f":"IF(ISBLANK(CHOOSE(control!$C$4,data!O7,data!O39)),\"\",CHOOSE(control!$C$4,data!O7,data!O39))","v":3.3000000000000002E-2},{"$f":"IF(ISBLANK(CHOOSE(control!$C$4,data!P7,data!P39)),\"\",CHOOSE(control!$C$4,data!P7,data!P39))","v":3.7999999999999999E-2},{"$f":"IF(ISBLANK(CHOOSE(control!$C$4,data!Q7,data!Q39)),\"\",CHOOSE(control!$C$4,data!Q7,data!Q39))","v":3.7000000000000005E-2},{"$f":"IF(ISBLANK(CHOOSE(control!$C$4,data!R7,data!R39)),\"\",CHOOSE(control!$C$4,data!R7,data!R39))","v":4.7E-2},{"$f":"IF(ISBLANK(CHOOSE(control!$C$4,data!S7,data!S39)),\"\",CHOOSE(control!$C$4,data!S7,data!S39))","v":4.7E-2},{"$f":"IF(ISBLANK(CHOOSE(control!$C$4,data!T7,data!T39)),\"\",CHOOSE(control!$C$4,data!T7,data!T39))","v":4.4999999999999998E-2},{"$f":"IF(ISBLANK(CHOOSE(control!$C$4,data!U7,data!U39)),\"\",CHOOSE(control!$C$4,data!U7,data!U39))","v":4.0999999999999995E-2},{"$f":"IF(ISBLANK(CHOOSE(control!$C$4,data!V7,data!V39)),\"\",CHOOSE(control!$C$4,data!V7,data!V39))","v":3.4000000000000002E-2},{"$f":"IF(ISBLANK(CHOOSE(control!$C$4,data!W7,data!W39)),\"\",CHOOSE(control!$C$4,data!W7,data!W39))","v":4.4000000000000004E-2},{"$f":"IF(ISBLANK(CHOOSE(control!$C$4,data!X7,data!X39)),\"\",CHOOSE(control!$C$4,data!X7,data!X39))","v":4.0999999999999995E-2},{"$f":"IF(ISBLANK(CHOOSE(control!$C$4,data!Y7,data!Y39)),\"\",CHOOSE(control!$C$4,data!Y7,data!Y39))","v":3.9E-2},{"$f":"IF(ISBLANK(CHOOSE(control!$C$4,data!Z7,data!Z39)),\"\",CHOOSE(control!$C$4,data!Z7,data!Z39))","v":4.2000000000000003E-2},{"$f":"IF(ISBLANK(CHOOSE(control!$C$4,data!AA7,data!AA39)),\"\",CHOOSE(control!$C$4,data!AA7,data!AA39))","v":4.7E-2},{"$f":"IF(ISBLANK(CHOOSE(control!$C$4,data!AB7,data!AB39)),\"\",CHOOSE(control!$C$4,data!AB7,data!AB39))","v":""}]
[null,null,{"$f":"data!B8","v":"Belgium"},{"$f":"IF(ISBLANK(CHOOSE(control!$C$4,data!D8,data!D40)),\"\",CHOOSE(control!$C$4,data!D8,data!D40))","v":5.4000000000000006E-2},{"$f":"IF(ISBLANK(CHOOSE(control!$C$4,data!E8,data!E40)),\"\",CHOOSE(control!$C$4,data!E8,data!E40))","v":5.4000000000000006E-2},{"$f":"IF(ISBLANK(CHOOSE(control!$C$4,data!F8,data!F40)),\"\",CHOOSE(control!$C$4,data!F8,data!F40))","v":0.06},{"$f":"IF(ISBLANK(CHOOSE(control!$C$4,data!G8,data!G40)),\"\",CHOOSE(control!$C$4,data!G8,data!G40))","v":7.0999999999999994E-2},{"$f":"IF(ISBLANK(CHOOSE(control!$C$4,data!H8,data!H40)),\"\",CHOOSE(control!$C$4,data!H8,data!H40))","v":8.1000000000000003E-2},{"$f":"IF(ISBLANK(CHOOSE(control!$C$4,data!I8,data!I40)),\"\",CHOOSE(control!$C$4,data!I8,data!I40))","v":8.1000000000000003E-2},{"$f":"IF(ISBLANK(CHOOSE(control!$C$4,data!J8,data!J40)),\"\",CHOOSE(control!$C$4,data!J8,data!J40))","v":8.1000000000000003E-2},{"$f":"IF(ISBLANK(CHOOSE(control!$C$4,data!K8,data!K40)),\"\",CHOOSE(control!$C$4,data!K8,data!K40))","v":7.8E-2},{"$f":"IF(ISBLANK(CHOOSE(control!$C$4,data!L8,data!L40)),\"\",CHOOSE(control!$C$4,data!L8,data!L40))","v":0.08},{"$f":"IF(ISBLANK(CHOOSE(control!$C$4,data!M8,data!M40)),\"\",CHOOSE(control!$C$4,data!M8,data!M40))","v":7.0999999999999994E-2},{"$f":"IF(ISBLANK(CHOOSE(control!$C$4,data!N8,data!N40)),\"\",CHOOSE(control!$C$4,data!N8,data!N40))","v":5.7999999999999996E-2},{"$f":"IF(ISBLANK(CHOOSE(control!$C$4,data!O8,data!O40)),\"\",CHOOSE(control!$C$4,data!O8,data!O40))","v":5.4000000000000006E-2},{"$f":"IF(ISBLANK(CHOOSE(control!$C$4,data!P8,data!P40)),\"\",CHOOSE(control!$C$4,data!P8,data!P40))","v":6.4000000000000001E-2},{"$f":"IF(ISBLANK(CHOOSE(control!$C$4,data!Q8,data!Q40)),\"\",CHOOSE(control!$C$4,data!Q8,data!Q40))","v":6.7000000000000004E-2},{"$f":"IF(ISBLANK(CHOOSE(control!$C$4,data!R8,data!R40)),\"\",CHOOSE(control!$C$4,data!R8,data!R40))","v":7.0000000000000007E-2},{"$f":"IF(ISBLANK(CHOOSE(control!$C$4,data!S8,data!S40)),\"\",CHOOSE(control!$C$4,data!S8,data!S40))","v":7.0999999999999994E-2},{"$f":"IF(ISBLANK(CHOOSE(control!$C$4,data!T8,data!T40)),\"\",CHOOSE(control!$C$4,data!T8,data!T40))","v":7.0000000000000007E-2},{"$f":"IF(ISBLANK(CHOOSE(control!$C$4,data!U8,data!U40)),\"\",CHOOSE(control!$C$4,data!U8,data!U40))","v":6.3E-2},{"$f":"IF(ISBLANK(CHOOSE(control!$C$4,data!V8,data!V40)),\"\",CHOOSE(control!$C$4,data!V8,data!V40))","v":5.9000000000000004E-2},{"$f":"IF(ISBLANK(CHOOSE(control!$C$4,data!W8,data!W40)),\"\",CHOOSE(control!$C$4,data!W8,data!W40))","v":6.6000000000000003E-2},{"$f":"IF(ISBLANK(CHOOSE(control!$C$4,data!X8,data!X40)),\"\",CHOOSE(control!$C$4,data!X8,data!X40))","v":7.0000000000000007E-2},{"$f":"IF(ISBLANK(CHOOSE(control!$C$4,data!Y8,data!Y40)),\"\",CHOOSE(control!$C$4,data!Y8,data!Y40))","v":0.06},{"$f":"IF(ISBLANK(CHOOSE(control!$C$4,data!Z8,data!Z40)),\"\",CHOOSE(control!$C$4,data!Z8,data!Z40))","v":6.4000000000000001E-2},{"$f":"IF(ISBLANK(CHOOSE(control!$C$4,data!AA8,data!AA40)),\"\",CHOOSE(control!$C$4,data!AA8,data!AA40))","v":7.0999999999999994E-2},{"$f":"IF(ISBLANK(CHOOSE(control!$C$4,data!AB8,data!AB40)),\"\",CHOOSE(control!$C$4,data!AB8,data!AB40))","v":7.2999999999999995E-2}]
[null,null,{"$f":"data!B9","v":"Bulgaria"},{"$f":"IF(ISBLANK(CHOOSE(control!$C$4,data!D9,data!D41)),\"\",CHOOSE(control!$C$4,data!D9,data!D41))","v":""},{"$f":"IF(ISBLANK(CHOOSE(control!$C$4,data!E9,data!E41)),\"\",CHOOSE(control!$C$4,data!E9,data!E41))","v":""},{"$f":"IF(ISBLANK(CHOOSE(control!$C$4,data!F9,data!F41)),\"\",CHOOSE(control!$C$4,data!F9,data!F41))","v":""},{"$f":"IF(ISBLANK(CHOOSE(control!$C$4,data!G9,data!G41)),\"\",CHOOSE(control!$C$4,data!G9,data!G41))","v":""},{"$f":"IF(ISBLANK(CHOOSE(control!$C$4,data!H9,data!H41)),\"\",CHOOSE(control!$C$4,data!H9,data!H41))","v":""},{"$f":"IF(ISBLANK(CHOOSE(control!$C$4,data!I9,data!I41)),\"\",CHOOSE(control!$C$4,data!I9,data!I41))","v":""},{"$f":"IF(ISBLANK(CHOOSE(control!$C$4,data!J9,data!J41)),\"\",CHOOSE(control!$C$4,data!J9,data!J41))","v":""},{"$f":"IF(ISBLANK(CHOOSE(control!$C$4,data!K9,data!K41)),\"\",CHOOSE(control!$C$4,data!K9,data!K41))","v":""},{"$f":"IF(ISBLANK(CHOOSE(control!$C$4,data!L9,data!L41)),\"\",CHOOSE(control!$C$4,data!L9,data!L41))","v":""},{"$f":"IF(ISBLANK(CHOOSE(control!$C$4,data!M9,data!M41)),\"\",CHOOSE(control!$C$4,data!M9,data!M41))","v":""},{"$f":"IF(ISBLANK(CHOOSE(control!$C$4,data!N9,data!N41)),\"\",CHOOSE(control!$C$4,data!N9,data!N41))","v":0.14499999999999999},{"$f":"IF(ISBLANK(CHOOSE(control!$C$4,data!O9,data!O41)),\"\",CHOOSE(control!$C$4,data!O9,data!O41))","v":0.17199999999999999},{"$f":"IF(ISBLANK(CHOOSE(control!$C$4,data!P9,data!P41)),\"\",CHOOSE(control!$C$4,data!P9,data!P41))","v":0.16200000000000001},{"$f":"IF(ISBLANK(CHOOSE(control!$C$4,data!Q9,data!Q41)),\"\",CHOOSE(control!$C$4,data!Q9,data!Q41))","v":0.124},{"$f":"IF(ISBLANK(CHOOSE(control!$C$4,data!R9,data!R41)),\"\",CHOOSE(control!$C$4,data!R9,data!R41))","v":0.10800000000000001},{"$f":"IF(ISBLANK(CHOOSE(control!$C$4,data!S9,data!S41)),\"\",CHOOSE(control!$C$4,data!S9,data!S41))","v":0.09},{"$f":"IF(ISBLANK(CHOOSE(control!$C$4,data!T9,data!T41)),\"\",CHOOSE(control!$C$4,data!T9,data!T41))","v":8.1000000000000003E-2},{"$f":"IF(ISBLANK(CHOOSE(control!$C$4,data!U9,data!U41)),\"\",CHOOSE(control!$C$4,data!U9,data!U41))","v":6.2E-2},{"$f":"IF(ISBLANK(CHOOSE(control!$C$4,data!V9,data!V41)),\"\",CHOOSE(control!$C$4,data!V9,data!V41))","v":0.05},{"$f":"IF(ISBLANK(CHOOSE(control!$C$4,data!W9,data!W41)),\"\",CHOOSE(control!$C$4,data!W9,data!W41))","v":6.0999999999999999E-2},{"$f":"IF(ISBLANK(CHOOSE(control!$C$4,data!X9,data!X41)),\"\",CHOOSE(control!$C$4,data!X9,data!X41))","v":9.3000000000000013E-2},{"$f":"IF(ISBLANK(CHOOSE(control!$C$4,data!Y9,data!Y41)),\"\",CHOOSE(control!$C$4,data!Y9,data!Y41))","v":0.10099999999999999},{"$f":"IF(ISBLANK(CHOOSE(control!$C$4,data!Z9,data!Z41)),\"\",CHOOSE(control!$C$4,data!Z9,data!Z41))","v":0.11},{"$f":"IF(ISBLANK(CHOOSE(control!$C$4,data!AA9,data!AA41)),\"\",CHOOSE(control!$C$4,data!AA9,data!AA41))","v":0.11800000000000001},{"$f":"IF(ISBLANK(CHOOSE(control!$C$4,data!AB9,data!AB41)),\"\",CHOOSE(control!$C$4,data!AB9,data!AB41))","v":0.10800000000000001}]
[null,null,{"$f":"data!B10","v":"Croatia"},{"$f":"IF(ISBLANK(CHOOSE(control!$C$4,data!D10,data!D42)),\"\",CHOOSE(control!$C$4,data!D10,data!D42))","v":""},{"$f":"IF(ISBLANK(CHOOSE(control!$C$4,data!E10,data!E42)),\"\",CHOOSE(control!$C$4,data!E10,data!E42))","v":""},{"$f":"IF(ISBLANK(CHOOSE(control!$C$4,data!F10,data!F42)),\"\",CHOOSE(control!$C$4,data!F10,data!F42))","v":""},{"$f":"IF(ISBLANK(CHOOSE(control!$C$4,data!G10,data!G42)),\"\",CHOOSE(control!$C$4,data!G10,data!G42))","v":""},{"$f":"IF(ISBLANK(CHOOSE(control!$C$4,data!H10,data!H42)),\"\",CHOOSE(control!$C$4,data!H10,data!H42))","v":""},{"$f":"IF(ISBLANK(CHOOSE(control!$C$4,data!I10,data!I42)),\"\",CHOOSE(control!$C$4,data!I10,data!I42))","v":""},{"$f":"IF(ISBLANK(CHOOSE(control!$C$4,data!J10,data!J42)),\"\",CHOOSE(control!$C$4,data!J10,data!J42))","v":""},{"$f":"IF(ISBLANK(CHOOSE(control!$C$4,data!K10,data!K42)),\"\",CHOOSE(control!$C$4,data!K10,data!K42))","v":""},{"$f":"IF(ISBLANK(CHOOSE(control!$C$4,data!L10,data!L42)),\"\",CHOOSE(control!$C$4,data!L10,data!L42))","v":""},{"$f":"IF(ISBLANK(CHOOSE(control!$C$4,data!M10,data!M42)),\"\",CHOOSE(control!$C$4,data!M10,data!M42))","v":""},{"$f":"IF(ISBLANK(CHOOSE(control!$C$4,data!N10,data!N42)),\"\",CHOOSE(control!$C$4,data!N10,data!N42))","v":0.125},{"$f":"IF(ISBLANK(CHOOSE(control!$C$4,data!O10,data!O42)),\"\",CHOOSE(control!$C$4,data!O10,data!O42))","v":0.121},{"$f":"IF(ISBLANK(CHOOSE(control!$C$4,data!P10,data!P42)),\"\",CHOOSE(control!$C$4,data!P10,data!P42))","v":0.121},{"$f":"IF(ISBLANK(CHOOSE(control!$C$4,data!Q10,data!Q42)),\"\",CHOOSE(control!$C$4,data!Q10,data!Q42))","v":0.113},{"$f":"IF(ISBLANK(CHOOSE(control!$C$4,data!R10,data!R42)),\"\",CHOOSE(control!$C$4,data!R10,data!R42))","v":0.114},{"$f":"IF(ISBLANK(CHOOSE(control!$C$4,data!S10,data!S42)),\"\",CHOOSE(control!$C$4,data!S10,data!S42))","v":0.105},{"$f":"IF(ISBLANK(CHOOSE(control!$C$4,data!T10,data!T42)),\"\",CHOOSE(control!$C$4,data!T10,data!T42))","v":9.6000000000000002E-2},{"$f":"IF(ISBLANK(CHOOSE(control!$C$4,data!U10,data!U42)),\"\",CHOOSE(control!$C$4,data!U10,data!U42))","v":8.199999999999999E-2},{"$f":"IF(ISBLANK(CHOOSE(control!$C$4,data!V10,data!V42)),\"\",CHOOSE(control!$C$4,data!V10,data!V42))","v":6.9000000000000006E-2},{"$f":"IF(ISBLANK(CHOOSE(control!$C$4,data!W10,data!W42)),\"\",CHOOSE(control!$C$4,data!W10,data!W42))","v":7.4999999999999997E-2},{"$f":"IF(ISBLANK(CHOOSE(control!$C$4,data!X10,data!X42)),\"\",CHOOSE(control!$C$4,data!X10,data!X42))","v":9.5000000000000001E-2},{"$f":"IF(ISBLANK(CHOOSE(control!$C$4,data!Y10,data!Y42)),\"\",CHOOSE(control!$C$4,data!Y10,data!Y42))","v":0.11599999999999999},{"$f":"IF(ISBLANK(CHOOSE(control!$C$4,data!Z10,data!Z42)),\"\",CHOOSE(control!$C$4,data!Z10,data!Z42))","v":0.13699999999999998},{"$f":"IF(ISBLANK(CHOOSE(control!$C$4,data!AA10,data!AA42)),\"\",CHOOSE(control!$C$4,data!AA10,data!AA42))","v":0.14400000000000002},{"$f":"IF(ISBLANK(CHOOSE(control!$C$4,data!AB10,data!AB42)),\"\",CHOOSE(control!$C$4,data!AB10,data!AB42))","v":0.14300000000000002}]
{"$rows_left_out":172}
{"sheet":"charts","index":4,"n_rows":2,"n_cols":2,"rows_kept":2,"cut":false,"hidden":false,"merged":[]}
[]
[null,"Line and Band Chart"]

{"sheet":"map icon","index":5,"n_rows":2,"n_cols":2,"rows_kept":2,"cut":false,"hidden":false,"merged":[]}
[]
[null,"Map \"Icon\""]