{"text_format":"1","workbook":"xlsx","n_sheets":3,"sheets":["map","data","control"],"not_rendered":{"charts":3,"images":1,"macros":1,"external_links":0,"defined_names":3,"comments":0,"pivot_tables":0},"unopened":[],"bounds":{"document_bytes":16777216,"sheet_cells":100000,"rows_first":2000,"rows_last":500,"rows_between":2000,"halvings":0,"cell_chars":16384,"cell_head_chars":4096},"cells_cut":0,"cells_raw":0,"read":"whole","date_system":"1900"}

{"sheet":"map","index":0,"n_rows":14,"n_cols":11,"rows_kept":14,"cut":false,"hidden":false,"merged":[[12,7,12,10],[13,7,13,8],[13,9,13,11]]}
[]
[null,"Select and Highlight Areas on a Chart",null,null,null,"European cities (more than 100k inhabitants)",null,null,null,null,"www.cs-analytics.de"]
[]
[null,"Selected Cities",{"$f":"control!C21","v":286},"Not selected Cities",{"$f":"control!C22","v":314},null,null,"Total Population",{"$f":"control!C23","v":106877166},"Average Population",{"$f":"control!C24","v":373696.38461538462}]
[]
[]
[null,null,null,null,null,null,null,null,"Radial  selection"]
[null,null,null,null,null,null,null,null,"Rectangular selection"]
[]
[null,null,null,null,null,null,null,"Keep SHIFT key pressed and click /drag on the map to select"]
[null,null,null,null,null,null,null,"Release the SHIFT key and click on the map again to deselect"]
[]
[null,null,null,null,null,null,null,"Top 15 countries selected "]
[null,null,null,null,null,null,null,"by selected cities",null,"by population in million"]

{"sheet":"data","index":1,"n_rows":604,"n_cols":6,"rows_kept":604,"cut":false,"hidden":false,"merged":[]}
[]
[null,"Data",null,"source:","www.geonames.org"]
[]
[null,"City","Country","Latitude","Longitude","Population"]
[null,"İstanbul","Turkey",41.013840000000002,28.949660000000002,11174257]
[null,"London","United Kingdom",51.50853,-0.12573999999999999,7556900]
[null,"Ankara","Turkey",39.919870000000003,32.85427,3517182]
[null,"Berlin","Germany",52.524369999999998,13.41053,3426354]
[null,"Madrid","Spain",40.416499999999999,-3.7025600000000001,3255944]
[null,"Kiev","Ukraine",50.454659999999997,30.523800000000001,2797553]
[null,"İzmir","Turkey",38.412730000000003,27.138380000000002,2500603]
[null,"Rome","Italy",41.891930000000002,12.511329999999999,2318895]
[null,"Paris","France",48.853409999999997,2.3488000000000002,2138551]
[null,"Bucharest","Romania",44.432250000000003,26.106259999999999,1877155]
[null,"Minsk","Belarus",53.9,27.566669999999998,1742124]
[null,"Budapest","Hungary",47.498010000000001,19.039909999999999,1741041]
[null,"Hamburg","Germany",53.575319999999998,10.01534,1739117]
[null,"Warsaw","Poland",52.229770000000002,21.011780000000002,1702139]
[null,"Vienna","Austria",48.208489999999998,16.37208,1691468]
[null,"Barcelona","Spain",41.38879,2.1589900000000002,1621537]
[null,"Kharkiv","Ukraine",49.980809999999998,36.252719999999997,1430885]
[null,"Bursa","Turkey",40.192659999999997,29.084029999999998,1412701]
[null,"Belgrade","Serbia",44.804009999999998,20.465129999999998,1273651]
[null,"Munich","Germany",48.137430000000002,11.57549,1260391]
[null,"Stockholm","Sweden",59.33258,18.064900000000002,1253309]
[null,"Adana","Turkey",37.001669999999997,35.328890000000001,1248988]
[null,"Milano","Italy",45.464269999999999,9.1895100000000003,1236837]
[null,"Prague","Czech Republic",50.088039999999999,14.42076,1165581]
[null,"Copenhagen","Denmark",55.675939999999997,12.565530000000001,1153615]
[null,"Sofia","Bulgaria",42.697510000000001,23.324149999999999,1152556]
[null,"Gaziantep","Turkey",37.059440000000002,37.3825,1065975]
[null,"Dnipropetrovsk","Ukraine",48.45,34.983330000000002,1032822]
[null,"Donetsk","Ukraine",48.023000000000003,37.802239999999998,1024700]
[null,"Dublin","Ireland",53.333060000000003,-6.2488900000000003,1024027]
[null,"Brussels","Belgium",50.850450000000002,4.3487799999999996,1019022]
[null,"Odessa","Ukraine",46.477469999999997,30.732620000000001,1001558]
[null,"Birmingham","United Kingdom",52.48142,-1.8998299999999999,984333]
[null,"Cologne","Germany",50.933329999999998,6.95,963395]
[null,"Napoli","Italy",40.856310000000001,14.246409999999999,959470]
[null,"Konya","Turkey",37.87135,32.484639999999999,875530]
[null,"Turin","Italy",45.070489999999999,7.68682,870456]
[null,"Valencia","Spain",39.469749999999998,-0.37739,814208]
[null,"Zaporizhzhya","Ukraine",47.822890000000001,35.190309999999997,796217]
[null,"Marseille","France",43.296950000000002,5.3810700000000002,794811]
[null,"Łódź","Poland",51.75,19.466670000000001,768755]
[null,"Antalya","Turkey",36.908119999999997,30.69556,758188]
[null,"Kraków","Poland",50.061430000000001,19.936579999999999,755050]
[null,"Riga","Latvia",56.945999999999998,24.105889999999999,742572]
[null,"Amsterdam","Netherlands",52.374029999999998,4.8896899999999999,741636]
[null,"L'viv","Ukraine",49.838259999999998,24.023240000000001,717803]
[null,"Sevilla","Spain",37.382829999999998,-5.9731699999999996,703206]
[null,"Zagreb","Croatia",45.814439999999998,15.977980000000001,698966]
[null,"Sarajevo","Bosnia and Herzegovina",43.848640000000003,18.356439999999999,696731]
[null,"Zaragoza","Spain",41.656059999999997,-0.87734000000000001,674317]
[null,"Athens","Greece",37.97945,23.71622,664046]
[null,"Kryvyi Rih","Ukraine",47.909660000000002,33.38044,652380]
[null,"Frankfurt am Main","Germany",50.115519999999997,8.6841699999999999,650000]
[null,"Palermo","Italy",38.13205,13.335610000000001,648260]
[null,"Chişinău","Moldova, Republic of",47.005560000000003,28.857500000000002,635994]
[null,"Wrocław","Poland",51.1,17.033329999999999,634893]
[null,"Glasgow","United Kingdom",55.86515,-4.2576299999999998,610268]
[null,"Rotterdam","Netherlands",51.922499999999999,4.4791699999999999,598199]
[null,"Essen","Germany",51.456569999999999,7.0122799999999996,593085]
[null,"Kayseri","Turkey",38.732219999999998,35.485280000000003,592840]
[null,"Stuttgart","Germany",48.782319999999999,9.1770200000000006,589793]
[null,"Dortmund","Germany",51.514940000000003,7.4660000000000002,588462]
[null,"Genoa","Italy",44.426400000000001,8.9151900000000008,580223]
[null,"Oslo","Norway",59.912730000000003,10.746090000000001,580000]
[null,"Düsseldorf","Germany",51.221719999999998,6.77616,573057]
[null,"Poznań","Poland",52.40692,16.929929999999999,570352]
[null,"Málaga","Spain",36.72016,-4.4203400000000004,568305]
[null,"Helsinki","Finland",60.169519999999999,24.935449999999999,558457]
[null,"Pristina","Kosovo",42.672719999999998,21.166879999999999,550000]
[null,"Bremen","Germany",53.075159999999997,8.8077699999999997,546501]
[null,"Vilnius","Lithuania",54.689160000000001,25.279800000000002,542366]
[null,"Mercin","Turkey",36.795259999999999,34.617919999999998,537842]
[null,"Lisbon","Portugal",38.716670000000001,-9.1333300000000008,517802]
[null,"Hannover","Germany",52.370519999999999,9.7332199999999993,515140]
[null,"Eskişehir","Turkey",39.776670000000003,30.52056,514869]
[null,"Mykolayiv","Ukraine",46.965910000000001,31.997399999999999,510840]
[null,"Leipzig","Germany",51.339619999999996,12.37129,504971]
[null,"Duisburg","Germany",51.432470000000002,6.7651599999999998,504358]
[null,"Göteborg","Sweden",57.707160000000002,11.96679,504084]
[null,"Nürnberg","Germany",49.454210000000003,11.07752,499237]
[null,"Dresden","Germany",51.050890000000003,13.73832,486854]
[null,"Mariupol","Ukraine",47.095140000000001,37.541310000000003,481626]
[null,"Gomel","Belarus",52.4345,30.9754,480951]
[null,"Skopje","Macedonia",41.996459999999999,21.43141,474889]
[null,"The Hague","Netherlands",52.07667,4.29861,474292]
[null,"Lyon","France",45.748460000000001,4.8467099999999999,472317]
[null,"Liverpool","United Kingdom",53.410580000000003,-2.9779399999999998,468945]
[null,"Gdańsk","Poland",54.352049999999998,18.646370000000001,461865]
[null,"Antwerpen","Belgium",51.219889999999999,4.4034599999999999,459805]
[null,"Leeds","United Kingdom",53.796480000000003,-1.5478499999999999,455123]
[null,"Luhansk","Ukraine",48.567050000000002,39.317059999999998,452000]
[null,"Şanlıurfa","Turkey",37.167079999999999,38.79392,449549]
[null,"Sheffield","United Kingdom",53.38297,-1.4659,447047]
[null,"Malatya","Turkey",38.350180000000002,38.316670000000002,441805]
[null,"Murcia","Spain",37.98704,-1.1300399999999999,436870]
[null,"Edinburgh","United Kingdom",55.952060000000003,-3.1964800000000002,435791]
[null,"Toulouse","France",43.604259999999996,1.44367,433055]
[null,"Bristol","United Kingdom",51.45523,-2.5966499999999999,430713]
[null,"Bratislava","Slovakia",48.148159999999997,17.106739999999999,423737]
[null,"Szczecin","Poland",53.428939999999997,14.55302,407811]
[null,"Palma","Spain",39.569389999999999,2.6502400000000002,401270]
[null,"Khmel’nyts’kyy","Ukraine",49.421610000000001,26.99653,398346]
[null,"Manchester","United Kingdom",53.48095,-2.2374299999999998,395515]
[null,"Samsun","Turkey",41.286670000000001,36.33,394050]
[null,"Tallinn","Estonia",59.436959999999999,24.753530000000001,394024]
[null,"Bochum","Germany",51.481650000000002,7.2164799999999998,385729]
[null,"Bochum-Hordel","Germany",51.50168,7.1756000000000002,380000]
[null,"Sevastopol","Ukraine",44.588830000000002,33.522399999999998,379200]
[null,"Makiyivka","Ukraine",48.047820000000002,37.925759999999997,376610]
[null,"Kahramanmaraş","Turkey",37.584699999999998,36.926409999999997,376045]
[null,"Tirana","Albania",41.327500000000001,19.81889,374801]
[null,"Kaunas","Lithuania",54.9,23.9,374643]
[null,"Brno","Czech Republic",49.195219999999999,16.607959999999999,369559]
[null,"Mahilyow","Belarus",53.916800000000002,30.344899999999999,369200]
[null,"Bydgoszcz","Poland",53.1235,18.007619999999999,366452]
[null,"Bologna","Italy",44.493810000000003,11.338749999999999,366133]
[null,"Wuppertal","Germany",51.270269999999996,7.1675500000000003,360797]
[null,"Lublin","Poland",51.25,22.566669999999998,360044]
[null,"Simferopol","Ukraine",44.957189999999997,34.110790000000001,358108]
[null,"Bilbao","Spain",43.262709999999998,-2.9252799999999999,354860]
[null,"Thessaloníki","Greece",40.643610000000002,22.930859999999999,354290]
[null,"Vinnytsya","Ukraine",49.232779999999998,28.480969999999999,352115]
[null,"Florence","Italy",43.779249999999998,11.246259999999999,349296]
[null,"Vitebsk","Belarus",55.190399999999997,30.204899999999999,342700]
[null,"Zürich","Switzerland",47.366669999999999,8.5500000000000007,341730]
[null,"Plovdiv","Bulgaria",42.15,24.75,340494]
[null,"Leicester","United Kingdom",52.638599999999997,-1.1316900000000001,339239]
[null,"Nice","France",43.703130000000002,7.2660799999999997,338620]
[null,"Alicante","Spain",38.345170000000003,-0.48148999999999997,334757]
[null,"Bielefeld","Germany",52.033329999999999,8.5333299999999994,331906]
[null,"Córdoba","Spain",37.891550000000002,-4.7727500000000003,328428]
[null,"Kherson","Ukraine",46.655810000000002,32.617800000000003,320477]
[null,"Iaşi","Romania",47.166670000000003,27.6,318012]
[null,"Valladolid","Spain",41.655180000000001,-4.7237200000000001,317864]
[null,"Poltava","Ukraine",49.593730000000001,34.540730000000003,317847]
[null,"Hrodna","Belarus",53.688400000000001,23.825800000000001,317365]
[null,"Katowice","Poland",50.258409999999998,19.027539999999998,317316]
[null,"Cluj-Napoca","Romania",46.766669999999998,23.6,316748]
[null,"Timişoara","Romania",45.753720000000001,21.225709999999999,315053]
[null,"Denizli","Turkey",37.774169999999998,29.087499999999999,313238]
[null,"Bonn","Germany",50.734380000000002,7.0954899999999999,313125]
[null,"Ostrava","Czech Republic",49.834650000000003,18.282039999999999,313088]
[null,"Varna","Bulgaria",43.216670000000001,27.91667,312770]
[null,"Coventry","United Kingdom",52.406559999999999,-1.51217,308313]
[null,"Mannheim","Germany",49.49671,8.4795499999999997,307960]
[null,"Chernihiv","Ukraine",51.505510000000001,31.284870000000002,307684]
[null,"Craiova","Romania",44.316670000000002,23.8,304142]
[null,"Constanţa","Romania",44.180729999999997,28.634319999999999,303399]
[null,"Hull","United Kingdom",53.744599999999998,-0.33524999999999999,302296]
[null,"Cardiff","United Kingdom",51.48,-3.18,302139]
[null,"Brest","Belarus",52.097549999999998,23.687750000000001,300715]
[null,"Bradford","United Kingdom",53.793909999999997,-1.75206,299310]
[null,"Elazığ","Turkey",38.674309999999998,39.223210000000002,298004]
[null,"Cherkasy","Ukraine",49.428539999999998,32.062069999999999,297568]
[null,"Vigo","Spain",42.232819999999997,-8.7226400000000002,297332]
[null,"Sumy","Ukraine",50.921599999999998,34.800289999999997,294456]
[null,"Galaţi","Romania",45.45,28.05,294087]
[null,"Białystok","Poland",53.133330000000001,23.16433,291855]
[null,"Catania","Italy",37.492229999999999,15.070410000000001,290927]
[null,"Utrecht","Netherlands",52.090829999999997,5.1222200000000004,290529]
[null,"Adapazarı","Turkey",40.780560000000001,30.40333,286787]
[null,"Karlsruhe","Germany",49.009369999999997,8.4044399999999992,283799]
[null,"Zhytomyr","Ukraine",50.264870000000002,28.676690000000001,282192]
[null,"Gebze","Turkey",40.802759999999999,29.430679999999999,281436]
[null,"Horlivka","Ukraine",48.335760000000001,38.053249999999998,278550]
[null,"Gijón","Spain",43.535730000000001,-5.6615200000000003,277554]
[null,"Bari","Italy",41.11148,16.855399999999999,277387]
[null,"Nantes","France",47.21725,-1.5533600000000001,277269]
[null,"Braşov","Romania",45.648609999999998,25.60613,276088]
[null,"Strasbourg","France",48.583919999999999,7.7455299999999996,274845]
[null,"Belfast","United Kingdom",54.583329999999997,-5.9333299999999998,274770]
[null,"Wiesbaden","Germany",50.08258,8.2493200000000009,272432]
[null,"Ljubljana","Slovenia",46.051079999999999,14.505129999999999,272220]
[null,"Münster","Germany",51.962359999999997,7.6257099999999998,270184]
[null,"Gelsenkirchen","Germany",51.5075,7.1228300000000004,270028]
[null,"Aachen","Germany",50.77664,6.0834200000000003,265208]
[null,"Sivas","Turkey",39.748330000000003,37.016109999999998,264022]
[null,"Mönchengladbach","Germany",51.185389999999998,6.4417200000000001,261742]
[null,"Malmö","Sweden",55.605870000000003,13.000730000000001,261548]
[null,"Stoke-on-Trent","United Kingdom",53.004150000000003,-2.1853799999999999,260419]
[null,"Augsburg","Germany",48.371540000000003,10.89851,259196]
[null,"Espoo","Finland",60.205199999999998,24.652200000000001,256760]
[null,"Tarsus","Turkey",36.918759999999999,34.878399999999999,256482]
[null,"Rivne","Ukraine",50.623080000000002,26.227429999999998,255106]
[null,"Gdynia","Poland",54.518889999999999,18.531880000000001,253730]
[null,"Wolverhampton","United Kingdom",52.585470000000001,-2.12296,252791]
[null,"Niš","Serbia",43.324719999999999,21.90333,250000]
[null,"Porto","Portugal",41.149610000000003,-8.6109899999999993,249633]
[null,"Kirovohrad","Ukraine",48.513199999999998,32.259700000000002,249454]
[null,"Dniprodzerzhyns’k","Ukraine",48.511339999999997,34.6021,248575]
[null,"Montpellier","France",43.61092,3.87723,248252]
[null,"Częstochowa","Poland",50.796460000000003,19.124089999999999,248125]
[null,"Plymouth","United Kingdom",50.37153,-4.1430499999999997,247297]
[null,"Chemnitz","Germany",50.835700000000003,12.929220000000001,247220]
[null,"Nottingham","United Kingdom",52.953600000000002,-1.1504700000000001,246654]
[null,"Southampton","United Kingdom",50.903950000000002,-1.40428,246201]
[null,"A Coruña","Spain",43.37135,-8.3960000000000008,246056]
[null,"Braunschweig","Germany",52.265940000000001,10.526730000000001,244715]
[null,"Trabzon","Turkey",41.005000000000003,39.726939999999999,244083]
[null,"Reading","United Kingdom",51.456249999999997,-0.97113000000000005,244070]
[null,"Manisa","Turkey",38.612020000000001,27.426469999999998,243971]
[null,"Halle Neustadt","Germany",51.479239999999997,11.91605,240000]
[null,"Balıkesir","Turkey",39.649169999999998,27.886109999999999,238151]
[null,"Krefeld","Germany",51.339210000000001,6.5861499999999999,237984]
[null,"Århus","Denmark",56.156739999999999,10.210760000000001,237551]
[null,"Košice","Slovakia",48.713949999999997,21.25808,236563]
[null,"Chernivtsi","Ukraine",48.291490000000003,25.940339999999999,236250]
[null,"Ternopil’","Ukraine",49.555889999999998,25.605560000000001,235676]
[null,"Gasteiz / Vitoria","Spain",42.849980000000002,-2.6726800000000002,235661]
[null,"Derby","United Kingdom",52.92277,-1.4766300000000001,235029]
[null,"Granada","Spain",37.18817,-3.6066699999999998,234325]
[null,"Halle (Saale)","Germany",51.5,12,234107]
[null,"Kiel","Germany",54.321330000000003,10.13489,232758]
[null,"Bordeaux","France",44.840440000000001,-0.58050000000000002,231844]
[null,"Gent","Belgium",51.05,3.7166700000000001,231493]
[null,"Elche","Spain",38.262180000000001,-0.70106999999999997,230112]
[null,"Magdeburg","Germany",52.12773,11.629160000000001,229826]
[null,"Ploieşti","Romania",44.95,26.016670000000001,228851]
[null,"Lille","France",50.63297,3.0585800000000001,228328]
[null,"Kremenchuk","Ukraine",49.068019999999997,33.420409999999997,227494]
[null,"Sosnowiec","Poland",50.286819999999999,19.103850000000001,227295]
[null,"Radom","Poland",51.402529999999999,21.14714,226794]
[null,"Oviedo","Spain",43.360289999999999,-5.84476,224005]
[null,"Adıyaman","Turkey",37.764409999999998,38.276290000000003,223744]
[null,"Graz","Austria",47.066670000000002,15.45,222326]
[null,"Banja Luka","Bosnia and Herzegovina",44.775829999999999,17.185559999999999,221106]
[null,"Babruysk","Belarus",53.138399999999997,29.221399999999999,220517]
[null,"Messina","Italy",38.193939999999998,15.55256,219948]
[null,"Badalona","Spain",41.450040000000001,2.2474099999999999,219547]
[null,"Oberhausen","Germany",51.473109999999998,6.8807400000000003,219176]
[null,"Verona","Italy",45.429900000000004,10.984439999999999,219103]
[null,"Freiburg","Germany",47.995899999999999,7.85222,215966]
[null,"Novi Sad","Serbia",45.251669999999997,19.836939999999998,215400]
[null,"Luts’k","Ukraine",50.759320000000002,25.34244,213661]
[null,"Bergen","Norway",60.392989999999998,5.3241500000000004,213585]
[null,"Brăila","Romania",45.266669999999998,27.983329999999999,213569]
[null,"Lübeck","Germany",53.868929999999999,10.687290000000001,212207]
[null,"Cartagena","Spain",37.605119999999999,-0.98623000000000005,211996]
[null,"Kırıkkale","Turkey",39.845280000000002,33.506390000000003,211138]
[null,"Terrassa","Spain",41.566670000000002,2.01667,210941]
[null,"Antakya","Turkey",36.20655,36.157220000000002,210000]
[null,"Eindhoven","Netherlands",51.440829999999998,5.4777800000000001,209620]
[null,"Rennes","France",48.111980000000003,-1.6742900000000001,209375]
[null,"Toruń","Poland",53.013750000000002,18.598140000000001,208717]
[null,"Kielce","Poland",50.870330000000003,20.627520000000001,208598]
[null,"Jerez de la Frontera","Spain",36.686450000000001,-6.1360599999999996,207532]
[null,"Oradea","Romania",47.066670000000002,21.933330000000002,206614]
[null,"Sabadell","Spain",41.543289999999999,2.1094200000000001,206493]
[null,"Móstoles","Spain",40.322339999999997,-3.86496,206478]
[null,"Alcalá de Henares","Spain",40.482050000000001,-3.3599600000000001,204574]
[null,"Ivano-Frankivs’k","Ukraine",48.921500000000002,24.709720000000001,204200]
[null,"Debrecen","Hungary",47.533329999999999,21.633330000000001,204124]
[null,"Padova","Italy",45.407969999999999,11.885859999999999,203725]
[null,"Erfurt","Germany",50.978700000000003,11.032830000000001,203254]
[null,"Osmaniye","Turkey",37.074170000000002,36.247779999999999,202837]
[null,"Tampere","Finland",61.499110000000002,23.787120000000002,202687]
[null,"Çorlu","Turkey",41.159170000000003,27.8,202578]
[null,"Harburg","Germany",53.460569999999997,9.9838799999999992,202571]
[null,"Charleroi","Belgium",50.411360000000002,4.4444800000000004,200132]
[null,"Tilburg","Netherlands",51.555509999999998,5.0913000000000004,199613]
[null,"Bila Tserkva","Ukraine",49.80939,30.112089999999998,199163]
[null,"Dudley","United Kingdom",52.5,-2.0833300000000001,199059]
[null,"Hagen","Germany",51.360810000000001,7.4716800000000001,198972]
[null,"Gliwice","Poland",50.297609999999999,18.676580000000001,198835]
[null,"Pamplona","Spain",42.816870000000002,-1.64323,198491]
[null,"Rostock","Germany",54.088700000000003,12.14049,198293]
[null,"Fuenlabrada","Spain",40.284190000000002,-3.7941500000000001,197836]
[null,"Northampton","United Kingdom",52.25,-0.88332999999999995,197322]
[null,"İzmit","Turkey",40.766939999999998,29.91694,196571]
[null,"Reims","France",49.25,4.0333300000000003,196565]
[null,"Burgas","Bulgaria",42.506059999999998,27.46781,195966]
[null,"Kassel","Germany",51.316670000000002,9.5,194501]
[null,"Portsmouth","United Kingdom",50.798990000000003,-1.0912500000000001,194150]
[null,"Luton","United Kingdom",51.879669999999997,-0.41748000000000002,193669]
[null,"Newcastle upon Tyne","United Kingdom",54.973280000000003,-1.6139600000000001,192382]
[null,"Klaipėda","Lithuania",55.717219999999998,21.1175,192307]
[null,"Zabrze","Poland",50.324919999999999,18.78576,192177]
[null,"Preston","United Kingdom",53.766669999999998,-2.7166700000000001,190687]
[null,"Cork","Ireland",51.897970000000001,-8.4706100000000006,190384]
[null,"Vantaa","Finland",60.294139999999999,25.040990000000001,190058]
[null,"Bytom","Poland",50.348019999999998,18.93282,189186]
[null,"Almería","Spain",36.838140000000003,-2.45974,188810]
[null,"Trieste","Italy",45.643250000000002,13.7903,187056]
[null,"Leganés","Spain",40.327179999999998,-3.7635000000000001,186066]
[null,"Le Havre","France",49.4938,0.10767,185972]
[null,"Dún Laoghaire","Ireland",53.293950000000002,-6.1358600000000001,185400]
[null,"Donostia / San Sebastián","Spain",43.312829999999998,-1.97499,185357]
[null,"Hamm","Germany",51.680329999999998,7.8208900000000003,185327]
[null,"Kütahya","Turkey",39.424169999999997,29.983329999999999,185008]
[null,"Mainz","Germany",49.984189999999998,8.2790999999999997,184997]
[null,"Brescia","Italy",45.535580000000003,10.21472,184826]
[null,"Milton Keynes","United Kingdom",52.041719999999998,-0.75583,184506]
[null,"Genève","Switzerland",46.202219999999997,6.1456900000000001,183981]
[null,"Aberdeen","United Kingdom",57.143689999999999,-2.0981399999999999,183790]
[null,"Cergy-Pontoise","France",49.038939999999997,2.0780500000000002,183430]
[null,"Çorum","Turkey",40.54889,34.953330000000001,183418]
[null,"Santander","Spain",43.46472,-3.80444,182700]
[null,"Liège","Belgium",50.63373,5.5674900000000003,182597]
[null,"Prato","Italy",43.873089999999998,11.08278,181820]
[null,"Saarbrücken","Germany",49.235399999999998,6.9816500000000001,181227]
[null,"Groningen","Netherlands",53.219169999999998,6.5666700000000002,181194]
[null,"Linz","Austria",48.30639,14.286110000000001,181162]
[null,"Taranto","Italy",40.41639,17.25478,181082]
[null,"Castelló de la Plana","Spain",39.983330000000002,-3.3329999999999999E-2,180005]
[null,"Burgos","Spain",42.35022,-3.6752699999999998,178966]
[null,"Amadora","Portugal",38.753819999999997,-9.2308299999999992,178858]
[null,"Sunderland","United Kingdom",54.904649999999997,-1.38222,177965]
[null,"Norwich","United Kingdom",52.627830000000003,1.29834,177636]
[null,"Bielsko-Biala","Poland",49.822450000000003,19.046859999999999,176515]
[null,"Almere Stad","Netherlands",52.370249999999999,5.2141299999999999,176432]
[null,"Split","Croatia",43.50891,16.439150000000001,176314]
[null,"Saint-Étienne","France",45.433889999999998,4.3899999999999997,176280]
[null,"Turku","Finland",60.451479999999997,22.268689999999999,175945]
[null,"Siverek","Turkey",37.755029999999998,39.316670000000002,175341]
[null,"Kramators’k","Ukraine",48.723050000000001,37.556289999999997,173700]
[null,"Miskolc","Hungary",48.1,20.783329999999999,172637]
[null,"Walsall","United Kingdom",52.585279999999997,-1.9839599999999999,172141]
[null,"Herne","Germany",51.538800000000002,7.2257199999999999,172108]
[null,"Olsztyn","Poland",53.779949999999999,20.494160000000001,171803]
[null,"Prizren","Kosovo",42.213889999999999,20.739719999999998,171464]
[null,"Bacău","Romania",46.566670000000002,26.9,171396]
[null,"Mülheim (Ruhr)","Germany",51.433329999999998,6.8833299999999999,171000]
[null,"Swansea","United Kingdom",51.62079,-3.9432299999999998,170883]
[null,"Albacete","Spain",38.994239999999998,-1.85643,169716]
[null,"Reggio Calabria","Italy",38.110469999999999,15.661289999999999,169140]
[null,"Arad","Romania",46.183329999999998,21.316669999999998,169065]
[null,"Baranovichi","Belarus",53.1327,26.0139,168772]
[null,"Toulon","France",43.116669999999999,5.9333299999999998,168701]
[null,"Angers","France",47.466670000000001,-0.55000000000000004,168279]
[null,"Alcorcón","Spain",40.345820000000003,-3.8248700000000002,167967]
[null,"Breda","Netherlands",51.586559999999999,4.7759600000000004,167673]
[null,"Piteşti","Romania",44.85,24.866669999999999,167669]
[null,"Getafe","Spain",40.305709999999998,-3.7329500000000002,167164]
[null,"Osnabrück","Germany",52.272640000000003,8.0497999999999994,166462]
[null,"Szeged","Hungary",46.253,20.148240000000001,164883]
[null,"Basel","Switzerland",47.558390000000003,7.5732699999999999,164488]
[null,"Zenica","Bosnia and Herzegovina",44.201689999999999,17.903970000000001,164423]
[null,"Solingen","Germany",51.173430000000003,7.0845000000000002,164359]
[null,"Pilsen","Czech Republic",49.74747,13.37759,164180]
[null,"Piraeus","Greece",37.947450000000003,23.637080000000001,163688]
[null,"Bournemouth","United Kingdom",50.720480000000002,-1.8794999999999999,163600]
[null,"Southend-on-Sea","United Kingdom",51.537820000000004,0.71433000000000002,163377]
[null,"Pátra","Greece",38.244439999999997,21.734439999999999,163360]
[null,"Ludwigshafen am Rhein","Germany",49.481209999999997,8.4464100000000002,163196]
[null,"Aydın","Turkey",37.845010000000002,27.83963,163022]
[null,"Leverkusen","Germany",51.030299999999997,6.9843200000000003,162738]
[null,"İskenderun","Turkey",36.587179999999996,36.173470000000002,159965]
[null,"Oldenburg","Germany",53.141179999999999,8.2146699999999999,159218]
[null,"Modena","Italy",44.647829999999999,10.92539,158886]
[null,"Nijmegen","Netherlands",51.842500000000001,5.8527800000000001,158732]
[null,"Grenoble","France",45.166670000000003,5.7166699999999997,158552]
[null,"Rzeszów","Poland",50.041319999999999,21.999009999999998,158382]
[null,"Melitopol’","Ukraine",46.848909999999997,35.36533,158000]
[null,"Tiraspol","Moldova, Republic of",46.84028,29.643329999999999,157000]
[null,"Pécs","Hungary",46.083329999999997,18.233329999999999,156649]
[null,"Ruse","Bulgaria",43.856389999999998,25.970829999999999,156238]
[null,"Salamanca","Spain",40.968820000000001,-5.6638799999999998,155619]
[null,"Swindon","United Kingdom",51.557969999999997,-1.7811600000000001,155432]
[null,"Oxford","United Kingdom",51.752220000000001,-1.25596,154566]
[null,"Viranşehir","Turkey",37.223489999999998,39.755189999999999,154163]
[null,"Livorno","Italy",43.544269999999997,10.32615,153773]
[null,"Enschede","Netherlands",52.218330000000002,6.8958300000000001,153655]
[null,"Uşak","Turkey",38.67351,29.405799999999999,152862]
[null,"Neuss","Germany",51.198070000000001,6.6850399999999999,152457]
[null,"Aksaray","Turkey",38.372549999999997,34.025370000000002,152201]
[null,"Kerch","Ukraine",45.360700000000001,36.470599999999997,152195]
[null,"Logroño","Spain",42.466670000000001,-2.4500000000000002,152107]
[null,"Sibiu","Romania",45.8,24.15,151894]
[null,"Dundee","United Kingdom",56.46913,-2.9748899999999998,151592]
[null,"Salzburg","Austria",47.799410000000002,13.043990000000001,150269]
[null,"Poole","United Kingdom",50.716670000000001,-2,150092]
[null,"Dijon","France",47.316670000000002,5.0166700000000004,149782]
[null,"Cagliari","Italy",39.230539999999998,9.1191700000000004,149257]
[null,"Huddersfield","United Kingdom",53.649039999999999,-1.78416,149017]
[null,"Huelva","Spain",37.266379999999998,-6.9400399999999998,148806]
[null,"Badajoz","Spain",38.877890000000001,-6.9706099999999998,148334]
[null,"Nîmes","France",43.833329999999997,4.3499999999999996,148236]
[null,"Mestre","Italy",45.471519999999998,12.240170000000001,147662]
[null,"Haarlem","Netherlands",52.380839999999999,4.6368299999999998,147590]
[null,"Kragujevac","Serbia",44.016669999999998,20.91667,147473]
[null,"Trondheim","Norway",63.430489999999999,10.395060000000001,147139]
[null,"Târgu-Mureş","Romania",46.542450000000002,24.557469999999999,146863]
[null,"Aix-en-Provence","France",43.528300000000002,5.4497299999999997,146821]
[null,"Saint-Quentin-en-Yvelines","France",48.771859999999997,2.01891,146598]
[null,"Parma","Italy",44.799349999999997,10.326180000000001,146299]
[null,"Ruda Śląska","Poland",50.258400000000002,18.85632,146189]
[null,"Afyonkarahisar","Turkey",38.75667,30.543330000000001,146136]
[null,"Odense","Denmark",55.395940000000003,10.388310000000001,145931]
[null,"Potsdam","Germany",52.398859999999999,13.065659999999999,145292]
[null,"Brest","France",48.4,-4.4833299999999996,144899]
[null,"Le Mans","France",48,0.2,144515]
[null,"York","United Kingdom",53.957630000000002,-1.0827100000000001,144202]
[null,"Ipswich","United Kingdom",52.059170000000002,1.1554500000000001,143767]
[null,"Stara Zagora","Bulgaria",42.432780000000001,25.641940000000002,143431]
[null,"Heidelberg","Germany",49.407679999999999,8.6907899999999998,143345]
[null,"Blackpool","United Kingdom",53.816670000000002,-3.05,143101]
[null,"Amiens","France",49.9,2.2999999999999998,143086]
[null,"Middlesbrough","United Kingdom",54.576230000000002,-1.2348300000000001,142707]
[null,"Rybnik","Poland",50.09713,18.541789999999999,142510]
[null,"Tuzla","Bosnia and Herzegovina",44.538420000000002,18.667090000000002,142486]
[null,"Paderborn","Germany",51.719050000000003,8.7543900000000008,142161]
[null,"Arnhem","Netherlands",51.98,5.9111099999999999,141674]
[null,"Tours","France",47.383330000000001,0.68332999999999999,141621]
[null,"Bolton","United Kingdom",53.583329999999997,-2.4333300000000002,141331]
[null,"Limoges","France",45.831530000000001,1.2578100000000001,141176]
[null,"Rijeka","Croatia",45.343060000000001,14.40917,141172]
[null,"Darmstadt","Germany",49.871670000000002,8.6502700000000008,140385]
[null,"Tarragona","Spain",41.116669999999999,1.25,140323]
[null,"Peterborough","United Kingdom",52.573639999999997,-0.24776999999999999,140141]
[null,"Zaanstad","Netherlands",52.453130000000002,4.8135599999999998,140085]
[null,"Peristéri","Greece",38.015389999999996,23.691870000000002,139981]
[null,"Amersfoort","Netherlands",52.155000000000001,5.3875000000000002,139914]
[null,"Stockport","United Kingdom",53.409790000000001,-2.15761,139052]
[null,"Brighton","United Kingdom",50.828380000000003,-0.13947000000000001,139001]
[null,"Clermont-Ferrand","France",45.77966,3.0862799999999999,138681]
[null,"Telford","United Kingdom",52.676589999999997,-2.4492600000000002,138241]
[null,"Baia Mare","Romania",47.653309999999998,23.57949,137976]
[null,"Irákleion","Greece",35.327869999999997,25.143409999999999,137154]
[null,"Foggia","Italy",41.458449999999999,15.551880000000001,137032]
[null,"Apeldoorn","Netherlands",52.21,5.9694399999999996,136670]
[null,"Baia Mare","Romania",47.657290000000003,23.568079999999998,136553]
[null,"Podgorica","Montenegro",42.441110000000002,19.26361,136473]
[null,"Lleida","Spain",41.61674,0.62217999999999996,135919]
[null,"West Bromwich","United Kingdom",52.518680000000003,-1.9944999999999999,135618]
[null,"Marbella","Spain",36.515430000000002,-4.8858300000000003,134623]
[null,"'s-Hertogenbosch","Netherlands",51.699170000000002,5.3041700000000001,134520]
[null,"León","Spain",42.600029999999997,-5.5703199999999997,134305]
[null,"Slough","United Kingdom",51.50949,-0.59540999999999999,134072]
[null,"Inegol","Turkey",40.078060000000001,29.51333,133959]
[null,"Würzburg","Germany",49.793909999999997,9.9512099999999997,133731]
[null,"Reggio nell'Emilia","Italy",44.698250000000002,10.63125,133296]
[null,"Hoofddorp","Netherlands",52.302500000000002,4.6888899999999998,132734]
[null,"Villeurbanne","France",45.766669999999998,4.8833299999999999,131445]
[null,"Buzău","Romania",45.15,26.83333,130954]
[null,"Pinsk","Belarus",52.122900000000001,26.095099999999999,130777]
[null,"Dąbrowa Górnicza","Poland",50.318179999999998,19.237400000000001,130601]
[null,"Šiauliai","Lithuania",55.933329999999998,23.316669999999998,130587]
[null,"Nikopol’","Ukraine",47.571190000000001,34.396369999999997,130500]
[null,"Syevyerodonets’k","Ukraine",48.948320000000002,38.491660000000003,130000]
[null,"Tychy","Poland",50.137169999999998,18.96641,130000]
[null,"Tokat","Turkey",40.313890000000001,36.55444,129702]
[null,"Acilia-Castel Fusano-Ostia Antica","Italy",41.763370000000002,12.330780000000001,129362]
[null,"Regensburg","Germany",49.034509999999997,12.11923,129151]
[null,"Lárisa","Greece",39.636890000000001,22.41761,128758]
[null,"Gloucester","United Kingdom",51.865679999999998,-2.2431000000000001,128721]
[null,"Oulu","Finland",65.012360000000001,25.468160000000001,128618]
[null,"Cambridge","United Kingdom",52.2,0.11667,128488]
[null,"Besançon","France",47.248779999999996,6.0181500000000003,128426]
[null,"Győr","Hungary",47.683329999999998,17.635120000000001,128265]
[null,"Uppsala","Sweden",59.858820000000001,17.63889,127734]
[null,"Opole","Poland",50.672110000000004,17.925329999999999,127676]
[null,"Elbląg","Poland",54.152200000000001,19.408840000000001,127558]
[null,"Płock","Poland",52.546819999999997,19.706379999999999,127474]
[null,"Wałbrzych","Poland",50.771410000000003,16.284320000000001,127431]
[null,"Cadiz","Spain",36.529780000000002,-6.2946499999999999,126766]
[null,"Edirne","Turkey",41.677190000000003,26.555969999999999,126470]
[null,"Salerno","Italy",40.675449999999998,14.793279999999999,125797]
[null,"Watford","United Kingdom",51.65531,-0.39601999999999998,125707]
[null,"Orsha","Belarus",54.508099999999999,30.417200000000001,125347]
[null,"Bălţi","Moldova, Republic of",47.761670000000002,27.928889999999999,125000]
[null,"Sloviansk","Ukraine",48.866669999999999,37.616669999999999,124800]
[null,"Gorzów Wielkopolski","Poland",52.736789999999999,15.22878,124430]
[null,"Orléans","France",47.902889999999999,1.9038900000000001,124149]
[null,"Metz","France",49.119109999999999,6.1726900000000002,123914]
[null,"Wolfsburg","Germany",52.424520000000001,10.781499999999999,123064]
[null,"Dos Hermanas","Spain",37.282870000000003,-5.9208800000000004,122943]
[null,"Recklinghausen","Germany",51.613790000000002,7.1973799999999999,122438]
[null,"Maastricht","Netherlands",50.848329999999997,5.6888899999999998,122378]
[null,"Tekirdağ","Turkey",40.978009999999998,27.508520000000001,122287]
[null,"Aalborg","Denmark",57.048000000000002,9.9186999999999994,122219]
[null,"Göttingen","Germany",51.53443,9.9322800000000004,122149]
[null,"Durrës","Albania",41.323059999999998,19.441389999999998,122034]
[null,"Mataró","Spain",41.542110000000001,2.4445000000000001,121722]
[null,"Bern","Switzerland",46.948090000000001,7.4474400000000003,121631]
[null,"Stavanger","Norway",58.970050000000001,5.73332,121610]
[null,"Braga","Portugal",41.550319999999999,-8.4200499999999998,121394]
[null,"Reykjavík","Iceland",64.135338000000004,-21.895209999999999,121230]
[null,"Heilbronn","Germany",49.139949999999999,9.2205399999999997,120733]
[null,"Ingolstadt","Germany",48.765079999999998,11.423719999999999,120658]
[null,"Ulm","Germany",48.398409999999998,9.9915500000000002,120451]
[null,"Karaman","Turkey",37.181109999999997,33.215000000000003,120399]
[null,"Włocławek","Poland",52.64817,19.067799999999998,120339]
[null,"Perugia","Italy",43.112200000000001,12.388780000000001,120137]
[null,"Bottrop","Germany",51.523919999999997,6.9284999999999997,119909]
[null,"Leiden","Netherlands",52.158329999999999,4.4930599999999998,119713]
[null,"Bergedorf","Germany",53.48462,10.229039999999999,119665]
[null,"Monza","Italy",45.58005,9.2724600000000006,119618]
[null,"Nazilli","Turkey",37.916310000000003,28.32225,119370]
[null,"Pforzheim","Germany",48.884360000000001,8.6989199999999993,119313]
[null,"Dordrecht","Netherlands",51.81,4.67361,119260]
[null,"Offenbach","Germany",50.100610000000003,8.76647,119192]
[null,"Pleven","Bulgaria",43.416670000000003,24.616669999999999,118675]
[null,"Rimini","Italy",44.057549999999999,12.56528,118673]
[null,"Zielona Góra","Poland",51.935479999999998,15.50643,118433]
[null,"Berdyans’k","Ukraine",46.766440000000003,36.798720000000003,118284]
[null,"Torrejón de Ardoz","Spain",40.455350000000003,-3.4697300000000002,118162]
[null,"Uzhhorod","Ukraine",48.616669999999999,22.3,117878]
[null,"Tarnów","Poland",50.013809999999999,20.986979999999999,117799]
[null,"Rotherham","United Kingdom",53.430120000000002,-1.3567800000000001,117618]
[null,"Bremerhaven","Germany",53.55021,8.5767299999999995,117446]
[null,"Panevėžys","Lithuania",55.733330000000002,24.35,117395]
[null,"Newport","United Kingdom",51.587739999999997,-2.9983499999999998,117326]
[null,"Remscheid","Germany",51.179830000000003,7.1924999999999999,117118]
[null,"Setúbal","Portugal",38.5244,-8.8881999999999994,117110]
[null,"Čačak","Serbia",43.891390000000001,20.349720000000001,117072]
[null,"Ordu","Turkey",40.984720000000003,37.878889999999998,116788]
[null,"Lausanne","Switzerland",46.515999999999998,6.6328199999999997,116751]
[null,"Brugge","Belgium",51.208919999999999,3.22424,116709]
[null,"Pescara","Italy",42.458399999999997,14.202830000000001,116596]
[null,"Jaén","Spain",37.769219999999997,-3.7902800000000001,116557]
[null,"Nyíregyháza","Hungary",47.955390000000001,21.716709999999999,116298]
[null,"Algeciras","Spain",36.13326,-5.4505100000000004,116209]
[null,"Alchevs’k","Ukraine",48.46893,38.816690000000001,116000]
[null,"Pavlohrad","Ukraine",48.534260000000003,35.870980000000003,115932]
[null,"Zoetermeer","Netherlands",52.057499999999997,4.4930599999999998,115845]
[null,"Parla","Spain",40.236040000000003,-3.7675200000000002,115611]
[null,"Botoşani","Romania",47.75,26.66667,114783]
[null,"Bergamo","Italy",45.696010000000001,9.6672100000000007,114162]
[null,"Erzincan","Turkey",39.739190000000001,39.49015,114027]
[null,"Chorzów","Poland",50.305819999999997,18.9742,113430]
[null,"Exeter","United Kingdom",50.723599999999998,-3.5275099999999999,113118]
[null,"Alanya","Turkey",36.543750000000003,31.99982,112969]
[null,"Eastbourne","United Kingdom",50.768709999999999,0.28453000000000001,112906]
[null,"Rouen","France",49.443129999999996,1.0993200000000001,112787]
[null,"Reutlingen","Germany",48.491439999999997,9.2042699999999993,112627]
[null,"Satu Mare","Romania",47.8,22.883330000000001,112490]
[null,"Innsbruck","Austria",47.262659999999997,11.394539999999999,112467]
[null,"Mazyr","Belarus",52.049500000000002,29.2456,112137]
[null,"Fürth","Germany",49.475929999999998,10.98856,112025]
[null,"Zwolle","Netherlands",52.512500000000003,6.0944399999999996,111805]
[null,"Lysychans’k","Ukraine",48.904850000000003,38.442070000000001,111600]
[null,"Daugavpils","Latvia",55.883330000000001,26.533329999999999,111564]
[null,"Mulhouse","France",47.75,7.3333300000000001,111430]
[null,"Turhal","Turkey",40.387500000000003,36.081110000000002,110884]
[null,"Perpignan","France",42.69764,2.89541,110706]
[null,"Caen","France",49.185850000000002,-0.35911999999999999,110624]
[null,"Bender","Moldova, Republic of",46.830559999999998,29.471109999999999,110175]
[null,"Mendip","United Kingdom",51.237200000000001,-2.6265999999999998,110000]
[null,"Kecskemét","Hungary",46.906179999999999,19.691279999999999,109847]
[null,"Colchester","United Kingdom",51.889209999999999,0.90420999999999996,109414]
[null,"Kalisz","Poland",51.761090000000003,18.09102,108759]
[null,"Moers","Germany",51.453420000000001,6.6326000000000001,107816]
[null,"Ourense","Spain",42.336689999999997,-7.8640699999999999,107742]
[null,"Bandırma","Turkey",40.352220000000003,27.976669999999999,107631]
[null,"Râmnicu Vâlcea","Romania",45.1,24.366669999999999,107558]
[null,"Alcobendas","Spain",40.547460000000001,-3.6419700000000002,107514]
[null,"Koszalin","Poland",54.194380000000002,16.172219999999999,107450]
[null,"Koblenz","Germany",50.353569999999998,7.57883,107319]
[null,"Siegen","Germany",50.874809999999997,8.0243099999999998,107242]
[null,"Västerås","Sweden",59.616169999999997,16.552759999999999,107194]
[null,"Vicenza","Italy",45.546720000000001,11.547499999999999,107129]
[null,"Reus","Spain",41.156120000000001,1.10687,107118]
[null,"Crawley","United Kingdom",51.113030000000002,-0.18312,107061]
[null,"Mitrovicë","Kosovo",42.883330000000001,20.866669999999999,107045]
[null,"Sutton Coldfield","United Kingdom",52.566670000000002,-1.81667,107030]
[null,"Coimbra","Portugal",40.205640000000002,-8.4195499999999992,106582]
[null,"Namur","Belgium",50.466900000000003,4.8674600000000003,106284]
[null,"Bergisch Gladbach","Germany",50.985599999999998,7.1329799999999999,106184]
[null,"Blackburn","United Kingdom",53.75,-2.48333,106154]
[null,"Legnica","Poland",51.210059999999999,16.161899999999999,106033]
[null,"Suceava","Romania",47.633330000000001,26.25,105796]
[null,"Nancy","France",48.68439,6.1849600000000002,105334]
[null,"Yevpatoriya","Ukraine",45.20091,33.366549999999997,105223]
[null,"Focşani","Romania",45.7,27.183330000000002,105112]
[null,"Oldham","United Kingdom",53.540509999999998,-2.1183000000000001,104782]
[null,"Jena","Germany",50.928780000000003,11.5899,104712]
[null,"Gera","Germany",50.880290000000002,12.08187,104659]
[null,"Mostar","Bosnia and Herzegovina",43.343330000000002,17.808060000000001,104518]
[null,"Yenakiyeve","Ukraine",48.233310000000003,38.211370000000002,104101]
[null,"Woking","United Kingdom",51.319029999999998,-0.55893000000000004,103932]
[null,"Queluz","Portugal",38.756570000000004,-9.2545099999999998,103399]
[null,"Turgutlu","Turkey",38.495330000000003,27.6997,103292]
[null,"Cheltenham","United Kingdom",51.9,-2.0833300000000001,103249]
[null,"Hildesheim","Germany",52.150770000000001,9.9511199999999995,103052]
[null,"Oleksandriya","Ukraine",48.669609999999999,33.115929999999999,103000]
[null,"Piatra Neamţ","Romania",46.916670000000003,26.33333,102688]
[null,"Erlangen","Germany",49.590989999999998,11.00783,102675]
[null,"Chelmsford","United Kingdom",51.735750000000003,0.46958,102671]
[null,"St Helens","United Kingdom",53.45,-2.73333,102555]
[null,"Drobeta-Turnu Severin","Romania",44.63194,22.656110000000002,102346]
[null,"Torrevieja","Spain",37.978720000000003,-0.68222000000000005,101792]
[null,"Salihorsk","Belarus",52.787599999999998,27.541499999999999,101614]
[null,"Székesfehérvár","Hungary",47.189950000000003,18.410340000000001,101600]
[null,"Argenteuil","France",48.95,2.25,101475]
[null,"Mustafakemalpaşa","Turkey",40.038150000000002,28.408660000000001,101412]
[null,"Basildon","United Kingdom",51.568440000000002,0.45782,101362]
[null,"Maladzyechna","Belarus",54.316699999999997,26.853999999999999,101300]
[null,"Olomouc","Czech Republic",49.59552,17.251750000000001,101268]
[null,"Witten","Germany",51.443620000000003,7.3525799999999997,101247]
[null,"Gillingham","United Kingdom",51.389139999999998,0.54862999999999995,101187]
[null,"Tartu","Estonia",58.38062,26.725090000000002,101092]
[null,"Elbasan","Albania",41.112499999999997,20.08222,100903]
[null,"Navapolatsk","Belarus",55.531799999999997,28.598700000000001,100885]
[null,"Kallithéa","Greece",37.950000000000003,23.7,100641]
[null,"Zonguldak","Turkey",41.451390000000004,31.793050000000001,100229]
[null,"Trier","Germany",49.755650000000003,6.6393500000000003,100129]
[null,"Worcester","United Kingdom",52.189349999999997,-2.2200099999999998,100023]
[null,"Horad Barysaw","Belarus",54.227899999999998,28.504999999999999,100000]
[null,"Kamieniec Podolski","Ukraine",48.6845,26.58559,100000]
[null,"Subotica","Serbia",46.1,19.66667,100000]

{"sheet":"control","index":2,"n_rows":670,"n_cols":14,"rows_kept":670,"cut":false,"hidden":false,"merged":[]}
[]
[null,"Control and Calculations",null,null,null,null,null,null,null,null,null,null,null,"www.cs-analytics.de"]
[]
[null,"Control parameters handled by option buttons and code"]
[]
[null,"Selection type",1]
[]
[null,"Start / Center Lat",49.060588235294119]
[null,"Start / Center Long",21.567157001414429]
[null,"Select Lat",58.257882352941181]
[null,"Select Long",13.062644978783595]
[]
[null,"Aspect Ratio",0.84158414602279663]
[]
[null,"Geometrical calculations"]
[]
[null,"Radius",{"$f":"SQRT((C10-C8)^2+(myAspectRatio*(C11-C9))^2)","v":11.654039016894401}]
[]
[null,"Displayed Measures"]
[]
[null,"Count selected",{"$f":"COUNTIF($F$29:$F$628,\">0\")","v":286}]
[null,"Count unselected",{"$f":"COUNTA(data!$B$5:$B$604)-C21","v":314}]
[null,"Total Population in m",{"$f":"SUM(F29:F628)","v":106877166}]
[null,"Average Population in 000",{"$f":"IFERROR(C23/C21,\"\")","v":373696.38461538462}]
[]
[null,"Selected cities"]
[]
[null,"City","Selected","Latitude","Longitude","Population"]
[null,{"$f":"data!B5","v":"İstanbul"},{"$f":"CHOOSE(mySelectionType,\nSQRT((data!D5-control!$C$8)^2+(myAspectRatio*(data!E5-control!$C$9))^2)<=control!$C$17,\nAND(data!D5<=control!$C$8,data!E5>=control!$C$9,data!D5>=control!$C$10,data!E5<=control!$C$11))","v":true},{"$f":"IF($C29,data!D5,NA())","v":41.013840000000002},{"$f":"IF($C29,data!E5,NA())","v":28.949660000000002},{"$f":"IF($C29,data!F5,0)","v":11174257}]
[null,{"$f":"data!B6","v":"London"},{"$f":"CHOOSE(mySelectionType,\nSQRT((data!D6-control!$C$8)^2+(myAspectRatio*(data!E6-control!$C$9))^2)<=control!$C$17,\nAND(data!D6<=control!$C$8,data!E6>=control!$C$9,data!D6>=control!$C$10,data!E6<=control!$C$11))","v":false},{"$f":"IF($C30,data!D6,NA())","v":{"$error":"#N/A"}},{"$f":"IF($C30,data!E6,NA())","v":{"$error":"#N/A"}},{"$f":"IF($C30,data!F6,0)","v":0}]
[null,{"$f":"data!B7","v":"Ankara"},{"$f":"CHOOSE(mySelectionType,\nSQRT((data!D7-control!$C$8)^2+(myAspectRatio*(data!E7-control!$C$9))^2)<=control!$C$17,\nAND(data!D7<=control!$C$8,data!E7>=control!$C$9,data!D7>=control!$C$10,data!E7<=control!$C$11))","v":false},{"$f":"IF($C31,data!D7,NA())","v":{"$error":"#N/A"}},{"$f":"IF($C31,data!E7,NA())","v":{"$error":"#N/A"}},{"$f":"IF($C31,data!F7,0)","v":0}]
[null,{"$f":"data!B8","v":"Berlin"},{"$f":"CHOOSE(mySelectionType,\nSQRT((data!D8-control!$C$8)^2+(myAspectRatio*(data!E8-control!$C$9))^2)<=control!$C$17,\nAND(data!D8<=control!$C$8,data!E8>=control!$C$9,data!D8>=control!$C$10,data!E8<=control!$C$11))","v":true},{"$f":"IF($C32,data!D8,NA())","v":52.524369999999998},{"$f":"IF($C32,data!E8,NA())","v":13.41053},{"$f":"IF($C32,data!F8,0)","v":3426354}]
[null,{"$f":"data!B9","v":"Madrid"},{"$f":"CHOOSE(mySelectionType,\nSQRT((data!D9-control!$C$8)^2+(myAspectRatio*(data!E9-control!$C$9))^2)<=control!$C$17,\nAND(data!D9<=control!$C$8,data!E9>=control!$C$9,data!D9>=control!$C$10,data!E9<=control!$C$11))","v":false},{"$f":"IF($C33,data!D9,NA())","v":{"$error":"#N/A"}},{"$f":"IF($C33,data!E9,NA())","v":{"$error":"#N/A"}},{"$f":"IF($C33,data!F9,0)","v":0}]
[null,{"$f":"data!B10","v":"Kiev"},{"$f":"CHOOSE(mySelectionType,\nSQRT((data!D10-control!$C$8)^2+(myAspectRatio*(data!E10-control!$C$9))^2)<=control!$C$17,\nAND(data!D10<=control!$C$8,data!E10>=control!$C$9,data!D10>=control!$C$10,data!E10<=control!$C$11))","v":true},{"$f":"IF($C34,data!D10,NA())","v":50.454659999999997},{"$f":"IF($C34,data!E10,NA())","v":30.523800000000001},{"$f":"IF($C34,data!F10,0)","v":2797553}]
[null,{"$f":"data!B11","v":"İzmir"},{"$f":"CHOOSE(mySelectionType,\nSQRT((data!D11-control!$C$8)^2+(myAspectRatio*(data!E11-control!$C$9))^2)<=control!$C$17,\nAND(data!D11<=control!$C$8,data!E11>=control!$C$9,data!D11>=control!$C$10,data!E11<=control!$C$11))","v":true},{"$f":"IF($C35,data!D11,NA())","v":38.412730000000003},{"$f":"IF($C35,data!E11,NA())","v":27.138380000000002},{"$f":"IF($C35,data!F11,0)","v":2500603}]
[null,{"$f":"data!B12","v":"Rome"},{"$f":"CHOOSE(mySelectionType,\nSQRT((data!D12-control!$C$8)^2+(myAspectRatio*(data!E12-control!$C$9))^2)<=control!$C$17,\nAND(data!D12<=control!$C$8,data!E12>=control!$C$9,data!D12>=control!$C$10,data!E12<=control!$C$11))","v":true},{"$f":"IF($C36,data!D12,NA())","v":41.891930000000002},{"$f":"IF($C36,data!E12,NA())","v":12.511329999999999},{"$f":"IF($C36,data!F12,0)","v":2318895}]
[null,{"$f":"data!B13","v":"Paris"},{"$f":"CHOOSE(mySelectionType,\nSQRT((data!D13-control!$C$8)^2+(myAspectRatio*(data!E13-control!$C$9))^2)<=control!$C$17,\nAND(data!D13<=control!$C$8,data!E13>=control!$C$9,data!D13>=control!$C$10,data!E13<=control!$C$11))","v":false},{"$f":"IF($C37,data!D13,NA())","v":{"$error":"#N/A"}},{"$f":"IF($C37,data!E13,NA())","v":{"$error":"#N/A"}},{"$f":"IF($C37,data!F13,0)","v":0}]
[null,{"$f":"data!B14","v":"Bucharest"},{"$f":"CHOOSE(mySelectionType,\nSQRT((data!D14-control!$C$8)^2+(myAspectRatio*(data!E14-control!$C$9))^2)<=control!$C$17,\nAND(data!D14<=control!$C$8,data!E14>=control!$C$9,data!D14>=control!$C$10,data!E14<=control!$C$11))","v":true},{"$f":"IF($C38,data!D14,NA())","v":44.432250000000003},{"$f":"IF($C38,data!E14,NA())","v":26.106259999999999},{"$f":"IF($C38,data!F14,0)","v":1877155}]
[null,{"$f":"data!B15","v":"Minsk"},{"$f":"CHOOSE(mySelectionType,\nSQRT((data!D15-control!$C$8)^2+(myAspectRatio*(data!E15-control!$C$9))^2)<=control!$C$17,\nAND(data!D15<=control!$C$8,data!E15>=control!$C$9,data!D15>=control!$C$10,data!E15<=control!$C$11))","v":true},{"$f":"IF($C39,data!D15,NA())","v":53.9},{"$f":"IF($C39,data!E15,NA())","v":27.566669999999998},{"$f":"IF($C39,data!F15,0)","v":1742124}]
[null,{"$f":"data!B16","v":"Budapest"},{"$f":"CHOOSE(mySelectionType,\nSQRT((data!D16-control!$C$8)^2+(myAspectRatio*(data!E16-control!$C$9))^2)<=control!$C$17,\nAND(data!D16<=control!$C$8,data!E16>=control!$C$9,data!D16>=control!$C$10,data!E16<=control!$C$11))","v":true},{"$f":"IF($C40,data!D16,NA())","v":47.498010000000001},{"$f":"IF($C40,data!E16,NA())","v":19.039909999999999},{"$f":"IF($C40,data!F16,0)","v":1741041}]
[null,{"$f":"data!B17","v":"Hamburg"},{"$f":"CHOOSE(mySelectionType,\nSQRT((data!D17-control!$C$8)^2+(myAspectRatio*(data!E17-control!$C$9))^2)<=control!$C$17,\nAND(data!D17<=control!$C$8,data!E17>=control!$C$9,data!D17>=control!$C$10,data!E17<=control!$C$11))","v":true},{"$f":"IF($C41,data!D17,NA())","v":53.575319999999998},{"$f":"IF($C41,data!E17,NA())","v":10.01534},{"$f":"IF($C41,data!F17,0)","v":1739117}]
[null,{"$f":"data!B18","v":"Warsaw"},{"$f":"CHOOSE(mySelectionType,\nSQRT((data!D18-control!$C$8)^2+(myAspectRatio*(data!E18-control!$C$9))^2)<=control!$C$17,\nAND(data!D18<=control!$C$8,data!E18>=control!$C$9,data!D18>=control!$C$10,data!E18<=control!$C$11))","v":true},{"$f":"IF($C42,data!D18,NA())","v":52.229770000000002},{"$f":"IF($C42,data!E18,NA())","v":21.011780000000002},{"$f":"IF($C42,data!F18,0)","v":1702139}]
[null,{"$f":"data!B19","v":"Vienna"},{"$f":"CHOOSE(mySelectionType,\nSQRT((data!D19-control!$C$8)^2+(myAspectRatio*(data!E19-control!$C$9))^2)<=control!$C$17,\nAND(data!D19<=control!$C$8,data!E19>=control!$C$9,data!D19>=control!$C$10,data!E19<=control!$C$11))","v":true},{"$f":"IF($C43,data!D19,NA())","v":48.208489999999998},{"$f":"IF($C43,data!E19,NA())","v":16.37208},{"$f":"IF($C43,data!F19,0)","v":1691468}]
[null,{"$f":"data!B20","v":"Barcelona"},{"$f":"CHOOSE(mySelectionType,\nSQRT((data!D20-control!$C$8)^2+(myAspectRatio*(data!E20-control!$C$9))^2)<=control!$C$17,\nAND(data!D20<=control!$C$8,data!E20>=control!$C$9,data!D20>=control!$C$10,data!E20<=control!$C$11))","v":false},{"$f":"IF($C44,data!D20,NA())","v":{"$error":"#N/A"}},{"$f":"IF($C44,data!E20,NA())","v":{"$error":"#N/A"}},{"$f":"IF($C44,data!F20,0)","v":0}]
[null,{"$f":"data!B21","v":"Kharkiv"},{"$f":"CHOOSE(mySelectionType,\nSQRT((data!D21-control!$C$8)^2+(myAspectRatio*(data!E21-control!$C$9))^2)<=control!$C$17,\nAND(data!D21<=control!$C$8,data!E21>=control!$C$9,data!D21>=control!$C$10,data!E21<=control!$C$11))","v":false},{"$f":"IF($C45,data!D21,NA())","v":{"$error":"#N/A"}},{"$f":"IF($C45,data!E21,NA())","v":{"$error":"#N/A"}},{"$f":"IF($C45,data!F21,0)","v":0}]
[null,{"$f":"data!B22","v":"Bursa"},{"$f":"CHOOSE(mySelectionType,\nSQRT((data!D22-control!$C$8)^2+(myAspectRatio*(data!E22-control!$C$9))^2)<=control!$C$17,\nAND(data!D22<=control!$C$8,data!E22>=control!$C$9,data!D22>=control!$C$10,data!E22<=control!$C$11))","v":true},{"$f":"IF($C46,data!D22,NA())","v":40.192659999999997},{"$f":"IF($C46,data!E22,NA())","v":29.084029999999998},{"$f":"IF($C46,data!F22,0)","v":1412701}]
[null,{"$f":"data!B23","v":"Belgrade"},{"$f":"CHOOSE(mySelectionType,\nSQRT((data!D23-control!$C$8)^2+(myAspectRatio*(data!E23-control!$C$9))^2)<=control!$C$17,\nAND(data!D23<=control!$C$8,data!E23>=control!$C$9,data!D23>=control!$C$10,data!E23<=control!$C$11))","v":true},{"$f":"IF($C47,data!D23,NA())","v":44.804009999999998},{"$f":"IF($C47,data!E23,NA())","v":20.465129999999998},{"$f":"IF($C47,data!F23,0)","v":1273651}]
[null,{"$f":"data!B24","v":"Munich"},{"$f":"CHOOSE(mySelectionType,\nSQRT((data!D24-control!$C$8)^2+(myAspectRatio*(data!E24-control!$C$9))^2)<=control!$C$17,\nAND(data!D24<=control!$C$8,data!E24>=control!$C$9,data!D24>=control!$C$10,data!E24<=control!$C$11))","v":true},{"$f":"IF($C48,data!D24,NA())","v":48.137430000000002},{"$f":"IF($C48,data!E24,NA())","v":11.57549},{"$f":"IF($C48,data!F24,0)","v":1260391}]
[null,{"$f":"data!B25","v":"Stockholm"},{"$f":"CHOOSE(mySelectionType,\nSQRT((data!D25-control!$C$8)^2+(myAspectRatio*(data!E25-control!$C$9))^2)<=control!$C$17,\nAND(data!D25<=control!$C$8,data!E25>=control!$C$9,data!D25>=control!$C$10,data!E25<=control!$C$11))","v":true},{"$f":"IF($C49,data!D25,NA())","v":59.33258},{"$f":"IF($C49,data!E25,NA())","v":18.064900000000002},{"$f":"IF($C49,data!F25,0)","v":1253309}]
[null,{"$f":"data!B26","v":"Adana"},{"$f":"CHOOSE(mySelectionType,\nSQRT((data!D26-control!$C$8)^2+(myAspectRatio*(data!E26-control!$C$9))^2)<=control!$C$17,\nAND(data!D26<=control!$C$8,data!E26>=control!$C$9,data!D26>=control!$C$10,data!E26<=control!$C$11))","v":false},{"$f":"IF($C50,data!D26,NA())","v":{"$error":"#N/A"}},{"$f":"IF($C50,data!E26,NA())","v":{"$error":"#N/A"}},{"$f":"IF($C50,data!F26,0)","v":0}]
[null,{"$f":"data!B27","v":"Milano"},{"$f":"CHOOSE(mySelectionType,\nSQRT((data!D27-control!$C$8)^2+(myAspectRatio*(data!E27-control!$C$9))^2)<=control!$C$17,\nAND(data!D27<=control!$C$8,data!E27>=control!$C$9,data!D27>=control!$C$10,data!E27<=control!$C$11))","v":true},{"$f":"IF($C51,data!D27,NA())","v":45.464269999999999},{"$f":"IF($C51,data!E27,NA())","v":9.1895100000000003},{"$f":"IF($C51,data!F27,0)","v":1236837}]
[null,{"$f":"data!B28","v":"Prague"},{"$f":"CHOOSE(mySelectionType,\nSQRT((data!D28-control!$C$8)^2+(myAspectRatio*(data!E28-control!$C$9))^2)<=control!$C$17,\nAND(data!D28<=control!$C$8,data!E28>=control!$C$9,data!D28>=control!$C$10,data!E28<=control!$C$11))","v":true},{"$f":"IF($C52,data!D28,NA())","v":50.088039999999999},{"$f":"IF($C52,data!E28,NA())","v":14.42076},{"$f":"IF($C52,data!F28,0)","v":1165581}]
[null,{"$f":"data!B29","v":"Copenhagen"},{"$f":"CHOOSE(mySelectionType,\nSQRT((data!D29-control!$C$8)^2+(myAspectRatio*(data!E29-control!$C$9))^2)<=control!$C$17,\nAND(data!D29<=control!$C$8,data!E29>=control!$C$9,data!D29>=control!$C$10,data!E29<=control!$C$11))","v":true},{"$f":"IF($C53,data!D29,NA())","v":55.675939999999997},{"$f":"IF($C53,data!E29,NA())","v":12.565530000000001},{"$f":"IF($C53,data!F29,0)","v":1153615}]
[null,{"$f":"data!B30","v":"Sofia"},{"$f":"CHOOSE(mySelectionType,\nSQRT((data!D30-control!$C$8)^2+(myAspectRatio*(data!E30-control!$C$9))^2)<=control!$C$17,\nAND(data!D30<=control!$C$8,data!E30>=control!$C$9,data!D30>=control!$C$10,data!E30<=control!$C$11))","v":true},{"$f":"IF($C54,data!D30,NA())","v":42.697510000000001},{"$f":"IF($C54,data!E30,NA())","v":23.324149999999999},{"$f":"IF($C54,data!F30,0)","v":1152556}]
[null,{"$f":"data!B31","v":"Gaziantep"},{"$f":"CHOOSE(mySelectionType,\nSQRT((data!D31-control!$C$8)^2+(myAspectRatio*(data!E31-control!$C$9))^2)<=control!$C$17,\nAND(data!D31<=control!$C$8,data!E31>=control!$C$9,data!D31>=control!$C$10,data!E31<=control!$C$11))","v":false},{"$f":"IF($C55,data!D31,NA())","v":{"$error":"#N/A"}},{"$f":"IF($C55,data!E31,NA())","v":{"$error":"#N/A"}},{"$f":"IF($C55,data!F31,0)","v":0}]
[null,{"$f":"data!B32","v":"Dnipropetrovsk"},{"$f":"CHOOSE(mySelectionType,\nSQRT((data!D32-control!$C$8)^2+(myAspectRatio*(data!E32-control!$C$9))^2)<=control!$C$17,\nAND(data!D32<=control!$C$8,data!E32>=control!$C$9,data!D32>=control!$C$10,data!E32<=control!$C$11))","v":true},{"$f":"IF($C56,data!D32,NA())","v":48.45},{"$f":"IF($C56,data!E32,NA())","v":34.983330000000002},{"$f":"IF($C56,data!F32,0)","v":1032822}]
[null,{"$f":"data!B33","v":"Donetsk"},{"$f":"CHOOSE(mySelectionType,\nSQRT((data!D33-control!$C$8)^2+(myAspectRatio*(data!E33-control!$C$9))^2)<=control!$C$17,\nAND(data!D33<=control!$C$8,data!E33>=control!$C$9,data!D33>=control!$C$10,data!E33<=control!$C$11))","v":false},{"$f":"IF($C57,data!D33,NA())","v":{"$error":"#N/A"}},{"$f":"IF($C57,data!E33,NA())","v":{"$error":"#N/A"}},{"$f":"IF($C57,data!F33,0)","v":0}]
[null,{"$f":"data!B34","v":"Dublin"},{"$f":"CHOOSE(mySelectionType,\nSQRT((data!D34-control!$C$8)^2+(myAspectRatio*(data!E34-control!$C$9))^2)<=control!$C$17,\nAND(data!D34<=control!$C$8,data!E34>=control!$C$9,data!D34>=control!$C$10,data!E34<=control!$C$11))","v":false},{"$f":"IF($C58,data!D34,NA())","v":{"$error":"#N/A"}},{"$f":"IF($C58,data!E34,NA())","v":{"$error":"#N/A"}},{"$f":"IF($C58,data!F34,0)","v":0}]
[null,{"$f":"data!B35","v":"Brussels"},{"$f":"CHOOSE(mySelectionType,\nSQRT((data!D35-control!$C$8)^2+(myAspectRatio*(data!E35-control!$C$9))^2)<=control!$C$17,\nAND(data!D35<=control!$C$8,data!E35>=control!$C$9,data!D35>=control!$C$10,data!E35<=control!$C$11))","v":false},{"$f":"IF($C59,data!D35,NA())","v":{"$error":"#N/A"}},{"$f":"IF($C59,data!E35,NA())","v":{"$error":"#N/A"}},{"$f":"IF($C59,data!F35,0)","v":0}]
[null,{"$f":"data!B36","v":"Odessa"},{"$f":"CHOOSE(mySelectionType,\nSQRT((data!D36-control!$C$8)^2+(myAspectRatio*(data!E36-control!$C$9))^2)<=control!$C$17,\nAND(data!D36<=control!$C$8,data!E36>=control!$C$9,data!D36>=control!$C$10,data!E36<=control!$C$11))","v":true},{"$f":"IF($C60,data!D36,NA())","v":46.477469999999997},{"$f":"IF($C60,data!E36,NA())","v":30.732620000000001},{"$f":"IF($C60,data!F36,0)","v":1001558}]
[null,{"$f":"data!B37","v":"Birmingham"},{"$f":"CHOOSE(mySelectionType,\nSQRT((data!D37-control!$C$8)^2+(myAspectRatio*(data!E37-control!$C$9))^2)<=control!$C$17,\nAND(data!D37<=control!$C$8,data!E37>=control!$C$9,data!D37>=control!$C$10,data!E37<=control!$C$11))","v":false},{"$f":"IF($C61,data!D37,NA())","v":{"$error":"#N/A"}},{"$f":"IF($C61,data!E37,NA())","v":{"$error":"#N/A"}},{"$f":"IF($C61,data!F37,0)","v":0}]
[null,{"$f":"data!B38","v":"Cologne"},{"$f":"CHOOSE(mySelectionType,\nSQRT((data!D38-control!$C$8)^2+(myAspectRatio*(data!E38-control!$C$9))^2)<=control!$C$17,\nAND(data!D38<=control!$C$8,data!E38>=control!$C$9,data!D38>=control!$C$10,data!E38<=control!$C$11))","v":false},{"$f":"IF($C62,data!D38,NA())","v":{"$error":"#N/A"}},{"$f":"IF($C62,data!E38,NA())","v":{"$error":"#N/A"}},{"$f":"IF($C62,data!F38,0)","v":0}]
[null,{"$f":"data!B39","v":"Napoli"},{"$f":"CHOOSE(mySelectionType,\nSQRT((data!D39-control!$C$8)^2+(myAspectRatio*(data!E39-control!$C$9))^2)<=control!$C$17,\nAND(data!D39<=control!$C$8,data!E39>=control!$C$9,data!D39>=control!$C$10,data!E39<=control!$C$11))","v":true},{"$f":"IF($C63,data!D39,NA())","v":40.856310000000001},{"$f":"IF($C63,data!E39,NA())","v":14.246409999999999},{"$f":"IF($C63,data!F39,0)","v":959470}]
[null,{"$f":"data!B40","v":"Konya"},{"$f":"CHOOSE(mySelectionType,\nSQRT((data!D40-control!$C$8)^2+(myAspectRatio*(data!E40-control!$C$9))^2)<=control!$C$17,\nAND(data!D40<=control!$C$8,data!E40>=control!$C$9,data!D40>=control!$C$10,data!E40<=control!$C$11))","v":false},{"$f":"IF($C64,data!D40,NA())","v":{"$error":"#N/A"}},{"$f":"IF($C64,data!E40,NA())","v":{"$error":"#N/A"}},{"$f":"IF($C64,data!F40,0)","v":0}]
[null,{"$f":"data!B41","v":"Turin"},{"$f":"CHOOSE(mySelectionType,\nSQRT((data!D41-control!$C$8)^2+(myAspectRatio*(data!E41-control!$C$9))^2)<=control!$C$17,\nAND(data!D41<=control!$C$8,data!E41>=control!$C$9,data!D41>=control!$C$10,data!E41<=control!$C$11))","v":false},{"$f":"IF($C65,data!D41,NA())","v":{"$error":"#N/A"}},{"$f":"IF($C65,data!E41,NA())","v":{"$error":"#N/A"}},{"$f":"IF($C65,data!F41,0)","v":0}]
[null,{"$f":"data!B42","v":"Valencia"},{"$f":"CHOOSE(mySelectionType,\nSQRT((data!D42-control!$C$8)^2+(myAspectRatio*(data!E42-control!$C$9))^2)<=control!$C$17,\nAND(data!D42<=control!$C$8,data!E42>=control!$C$9,data!D42>=control!$C$10,data!E42<=control!$C$11))","v":false},{"$f":"IF($C66,data!D42,NA())","v":{"$error":"#N/A"}},{"$f":"IF($C66,data!E42,NA())","v":{"$error":"#N/A"}},{"$f":"IF($C66,data!F42,0)","v":0}]
[null,{"$f":"data!B43","v":"Zaporizhzhya"},{"$f":"CHOOSE(mySelectionType,\nSQRT((data!D43-control!$C$8)^2+(myAspectRatio*(data!E43-control!$C$9))^2)<=control!$C$17,\nAND(data!D43<=control!$C$8,data!E43>=control!$C$9,data!D43>=control!$C$10,data!E43<=control!$C$11))","v":true},{"$f":"IF($C67,data!D43,NA())","v":47.822890000000001},{"$f":"IF($C67,data!E43,NA())","v":35.190309999999997},{"$f":"IF($C67,data!F43,0)","v":796217}]
[null,{"$f":"data!B44","v":"Marseille"},{"$f":"CHOOSE(mySelectionType,\nSQRT((data!D44-control!$C$8)^2+(myAspectRatio*(data!E44-control!$C$9))^2)<=control!$C$17,\nAND(data!D44<=control!$C$8,data!E44>=control!$C$9,data!D44>=control!$C$10,data!E44<=control!$C$11))","v":false},{"$f":"IF($C68,data!D44,NA())","v":{"$error":"#N/A"}},{"$f":"IF($C68,data!E44,NA())","v":{"$error":"#N/A"}},{"$f":"IF($C68,data!F44,0)","v":0}]
[null,{"$f":"data!B45","v":"Łódź"},{"$f":"CHOOSE(mySelectionType,\nSQRT((data!D45-control!$C$8)^2+(myAspectRatio*(data!E45-control!$C$9))^2)<=control!$C$17,\nAND(data!D45<=control!$C$8,data!E45>=control!$C$9,data!D45>=control!$C$10,data!E45<=control!$C$11))","v":true},{"$f":"IF($C69,data!D45,NA())","v":51.75},{"$f":"IF($C69,data!E45,NA())","v":19.466670000000001},{"$f":"IF($C69,data!F45,0)","v":768755}]
[null,{"$f":"data!B46","v":"Antalya"},{"$f":"CHOOSE(mySelectionType,\nSQRT((data!D46-control!$C$8)^2+(myAspectRatio*(data!E46-control!$C$9))^2)<=control!$C$17,\nAND(data!D46<=control!$C$8,data!E46>=control!$C$9,data!D46>=control!$C$10,data!E46<=control!$C$11))","v":false},{"$f":"IF($C70,data!D46,NA())","v":{"$error":"#N/A"}},{"$f":"IF($C70,data!E46,NA())","v":{"$error":"#N/A"}},{"$f":"IF($C70,data!F46,0)","v":0}]
[null,{"$f":"data!B47","v":"Kraków"},{"$f":"CHOOSE(mySelectionType,\nSQRT((data!D47-control!$C$8)^2+(myAspectRatio*(data!E47-control!$C$9))^2)<=control!$C$17,\nAND(data!D47<=control!$C$8,data!E47>=control!$C$9,data!D47>=control!$C$10,data!E47<=control!$C$11))","v":true},{"$f":"IF($C71,data!D47,NA())","v":50.061430000000001},{"$f":"IF($C71,data!E47,NA())","v":19.936579999999999},{"$f":"IF($C71,data!F47,0)","v":755050}]
[null,{"$f":"data!B48","v":"Riga"},{"$f":"CHOOSE(mySelectionType,\nSQRT((data!D48-control!$C$8)^2+(myAspectRatio*(data!E48-control!$C$9))^2)<=control!$C$17,\nAND(data!D48<=control!$C$8,data!E48>=control!$C$9,data!D48>=control!$C$10,data!E48<=control!$C$11))","v":true},{"$f":"IF($C72,data!D48,NA())","v":56.945999999999998},{"$f":"IF($C72,data!E48,NA())","v":24.105889999999999},{"$f":"IF($C72,data!F48,0)","v":742572}]
[null,{"$f":"data!B49","v":"Amsterdam"},{"$f":"CHOOSE(mySelectionType,\nSQRT((data!D49-control!$C$8)^2+(myAspectRatio*(data!E49-control!$C$9))^2)<=control!$C$17,\nAND(data!D49<=control!$C$8,data!E49>=control!$C$9,data!D49>=control!$C$10,data!E49<=control!$C$11))","v":false},{"$f":"IF($C73,data!D49,NA())","v":{"$error":"#N/A"}},{"$f":"IF($C73,data!E49,NA())","v":{"$error":"#N/A"}},{"$f":"IF($C73,data!F49,0)","v":0}]
[null,{"$f":"data!B50","v":"L'viv"},{"$f":"CHOOSE(mySelectionType,\nSQRT((data!D50-control!$C$8)^2+(myAspectRatio*(data!E50-control!$C$9))^2)<=control!$C$17,\nAND(data!D50<=control!$C$8,data!E50>=control!$C$9,data!D50>=control!$C$10,data!E50<=control!$C$11))","v":true},{"$f":"IF($C74,data!D50,NA())","v":49.838259999999998},{"$f":"IF($C74,data!E50,NA())","v":24.023240000000001},{"$f":"IF($C74,data!F50,0)","v":717803}]
[null,{"$f":"data!B51","v":"Sevilla"},{"$f":"CHOOSE(mySelectionType,\nSQRT((data!D51-control!$C$8)^2+(myAspectRatio*(data!E51-control!$C$9))^2)<=control!$C$17,\nAND(data!D51<=control!$C$8,data!E51>=control!$C$9,data!D51>=control!$C$10,data!E51<=control!$C$11))","v":false},{"$f":"IF($C75,data!D51,NA())","v":{"$error":"#N/A"}},{"$f":"IF($C75,data!E51,NA())","v":{"$error":"#N/A"}},{"$f":"IF($C75,data!F51,0)","v":0}]
[null,{"$f":"data!B52","v":"Zagreb"},{"$f":"CHOOSE(mySelectionType,\nSQRT((data!D52-control!$C$8)^2+(myAspectRatio*(data!E52-control!$C$9))^2)<=control!$C$17,\nAND(data!D52<=control!$C$8,data!E52>=control!$C$9,data!D52>=control!$C$10,data!E52<=control!$C$11))","v":true},{"$f":"IF($C76,data!D52,NA())","v":45.814439999999998},{"$f":"IF($C76,data!E52,NA())","v":15.977980000000001},{"$f":"IF($C76,data!F52,0)","v":698966}]
[null,{"$f":"data!B53","v":"Sarajevo"},{"$f":"CHOOSE(mySelectionType,\nSQRT((data!D53-control!$C$8)^2+(myAspectRatio*(data!E53-control!$C$9))^2)<=control!$C$17,\nAND(data!D53<=control!$C$8,data!E53>=control!$C$9,data!D53>=control!$C$10,data!E53<=control!$C$11))","v":true},{"$f":"IF($C77,data!D53,NA())","v":43.848640000000003},{"$f":"IF($C77,data!E53,NA())","v":18.356439999999999},{"$f":"IF($C77,data!F53,0)","v":696731}]
[null,{"$f":"data!B54","v":"Zaragoza"},{"$f":"CHOOSE(mySelectionType,\nSQRT((data!D54-control!$C$8)^2+(myAspectRatio*(data!E54-control!$C$9))^2)<=control!$C$17,\nAND(data!D54<=control!$C$8,data!E54>=control!$C$9,data!D54>=control!$C$10,data!E54<=control!$C$11))","v":false},{"$f":"IF($C78,data!D54,NA())","v":{"$error":"#N/A"}},{"$f":"IF($C78,data!E54,NA())","v":{"$error":"#N/A"}},{"$f":"IF($C78,data!F54,0)","v":0}]
[null,{"$f":"data!B55","v":"Athens"},{"$f":"CHOOSE(mySelectionType,\nSQRT((data!D55-control!$C$8)^2+(myAspectRatio*(data!E55-control!$C$9))^2)<=control!$C$17,\nAND(data!D55<=control!$C$8,data!E55>=control!$C$9,data!D55>=control!$C$10,data!E55<=control!$C$11))","v":true},{"$f":"IF($C79,data!D55,NA())","v":37.97945},{"$f":"IF($C79,data!E55,NA())","v":23.71622},{"$f":"IF($C79,data!F55,0)","v":664046}]
[null,{"$f":"data!B56","v":"Kryvyi Rih"},{"$f":"CHOOSE(mySelectionType,\nSQRT((data!D56-control!$C$8)^2+(myAspectRatio*(data!E56-control!$C$9))^2)<=control!$C$17,\nAND(data!D56<=control!$C$8,data!E56>=control!$C$9,data!D56>=control!$C$10,data!E56<=control!$C$11))","v":true},{"$f":"IF($C80,data!D56,NA())","v":47.909660000000002},{"$f":"IF($C80,data!E56,NA())","v":33.38044},{"$f":"IF($C80,data!F56,0)","v":652380}]
[null,{"$f":"data!B57","v":"Frankfurt am Main"},{"$f":"CHOOSE(mySelectionType,\nSQRT((data!D57-control!$C$8)^2+(myAspectRatio*(data!E57-control!$C$9))^2)<=control!$C$17,\nAND(data!D57<=control!$C$8,data!E57>=control!$C$9,data!D57>=control!$C$10,data!E57<=control!$C$11))","v":true},{"$f":"IF($C81,data!D57,NA())","v":50.115519999999997},{"$f":"IF($C81,data!E57,NA())","v":8.6841699999999999},{"$f":"IF($C81,data!F57,0)","v":650000}]
[null,{"$f":"data!B58","v":"Palermo"},{"$f":"CHOOSE(mySelectionType,\nSQRT((data!D58-control!$C$8)^2+(myAspectRatio*(data!E58-control!$C$9))^2)<=control!$C$17,\nAND(data!D58<=control!$C$8,data!E58>=control!$C$9,data!D58>=control!$C$10,data!E58<=control!$C$11))","v":false},{"$f":"IF($C82,data!D58,NA())","v":{"$error":"#N/A"}},{"$f":"IF($C82,data!E58,NA())","v":{"$error":"#N/A"}},{"$f":"IF($C82,data!F58,0)","v":0}]
[null,{"$f":"data!B59","v":"Chişinău"},{"$f":"CHOOSE(mySelectionType,\nSQRT((data!D59-control!$C$8)^2+(myAspectRatio*(data!E59-control!$C$9))^2)<=control!$C$17,\nAND(data!D59<=control!$C$8,data!E59>=control!$C$9,data!D59>=control!$C$10,data!E59<=control!$C$11))","v":true},{"$f":"IF($C83,data!D59,NA())","v":47.005560000000003},{"$f":"IF($C83,data!E59,NA())","v":28.857500000000002},{"$f":"IF($C83,data!F59,0)","v":635994}]
[null,{"$f":"data!B60","v":"Wrocław"},{"$f":"CHOOSE(mySelectionType,\nSQRT((data!D60-control!$C$8)^2+(myAspectRatio*(data!E60-control!$C$9))^2)<=control!$C$17,\nAND(data!D60<=control!$C$8,data!E60>=control!$C$9,data!D60>=control!$C$10,data!E60<=control!$C$11))","v":true},{"$f":"IF($C84,data!D60,NA())","v":51.1},{"$f":"IF($C84,data!E60,NA())","v":17.033329999999999},{"$f":"IF($C84,data!F60,0)","v":634893}]
[null,{"$f":"data!B61","v":"Glasgow"},{"$f":"CHOOSE(mySelectionType,\nSQRT((data!D61-control!$C$8)^2+(myAspectRatio*(data!E61-control!$C$9))^2)<=control!$C$17,\nAND(data!D61<=control!$C$8,data!E61>=control!$C$9,data!D61>=control!$C$10,data!E61<=control!$C$11))","v":false},{"$f":"IF($C85,data!D61,NA())","v":{"$error":"#N/A"}},{"$f":"IF($C85,data!E61,NA())","v":{"$error":"#N/A"}},{"$f":"IF($C85,data!F61,0)","v":0}]
[null,{"$f":"data!B62","v":"Rotterdam"},{"$f":"CHOOSE(mySelectionType,\nSQRT((data!D62-control!$C$8)^2+(myAspectRatio*(data!E62-control!$C$9))^2)<=control!$C$17,\nAND(data!D62<=control!$C$8,data!E62>=control!$C$9,data!D62>=control!$C$10,data!E62<=control!$C$11))","v":false},{"$f":"IF($C86,data!D62,NA())","v":{"$error":"#N/A"}},{"$f":"IF($C86,data!E62,NA())","v":{"$error":"#N/A"}},{"$f":"IF($C86,data!F62,0)","v":0}]
[null,{"$f":"data!B63","v":"Essen"},{"$f":"CHOOSE(mySelectionType,\nSQRT((data!D63-control!$C$8)^2+(myAspectRatio*(data!E63-control!$C$9))^2)<=control!$C$17,\nAND(data!D63<=control!$C$8,data!E63>=control!$C$9,data!D63>=control!$C$10,data!E63<=control!$C$11))","v":false},{"$f":"IF($C87,data!D63,NA())","v":{"$error":"#N/A"}},{"$f":"IF($C87,data!E63,NA())","v":{"$error":"#N/A"}},{"$f":"IF($C87,data!F63,0)","v":0}]
[null,{"$f":"data!B64","v":"Kayseri"},{"$f":"CHOOSE(mySelectionType,\nSQRT((data!D64-control!$C$8)^2+(myAspectRatio*(data!E64-control!$C$9))^2)<=control!$C$17,\nAND(data!D64<=control!$C$8,data!E64>=control!$C$9,data!D64>=control!$C$10,data!E64<=control!$C$11))","v":false},{"$f":"IF($C88,data!D64,NA())","v":{"$error":"#N/A"}},{"$f":"IF($C88,data!E64,NA())","v":{"$error":"#N/A"}},{"$f":"IF($C88,data!F64,0)","v":0}]
[null,{"$f":"data!B65","v":"Stuttgart"},{"$f":"CHOOSE(mySelectionType,\nSQRT((data!D65-control!$C$8)^2+(myAspectRatio*(data!E65-control!$C$9))^2)<=control!$C$17,\nAND(data!D65<=control!$C$8,data!E65>=control!$C$9,data!D65>=control!$C$10,data!E65<=control!$C$11))","v":true},{"$f":"IF($C89,data!D65,NA())","v":48.782319999999999},{"$f":"IF($C89,data!E65,NA())","v":9.1770200000000006},{"$f":"IF($C89,data!F65,0)","v":589793}]
[null,{"$f":"data!B66","v":"Dortmund"},{"$f":"CHOOSE(mySelectionType,\nSQRT((data!D66-control!$C$8)^2+(myAspectRatio*(data!E66-control!$C$9))^2)<=control!$C$17,\nAND(data!D66<=control!$C$8,data!E66>=control!$C$9,data!D66>=control!$C$10,data!E66<=control!$C$11))","v":false},{"$f":"IF($C90,data!D66,NA())","v":{"$error":"#N/A"}},{"$f":"IF($C90,data!E66,NA())","v":{"$error":"#N/A"}},{"$f":"IF($C90,data!F66,0)","v":0}]
[null,{"$f":"data!B67","v":"Genoa"},{"$f":"CHOOSE(mySelectionType,\nSQRT((data!D67-control!$C$8)^2+(myAspectRatio*(data!E67-control!$C$9))^2)<=control!$C$17,\nAND(data!D67<=control!$C$8,data!E67>=control!$C$9,data!D67>=control!$C$10,data!E67<=control!$C$11))","v":true},{"$f":"IF($C91,data!D67,NA())","v":44.426400000000001},{"$f":"IF($C91,data!E67,NA())","v":8.9151900000000008},{"$f":"IF($C91,data!F67,0)","v":580223}]
[null,{"$f":"data!B68","v":"Oslo"},{"$f":"CHOOSE(mySelectionType,\nSQRT((data!D68-control!$C$8)^2+(myAspectRatio*(data!E68-control!$C$9))^2)<=control!$C$17,\nAND(data!D68<=control!$C$8,data!E68>=control!$C$9,data!D68>=control!$C$10,data!E68<=control!$C$11))","v":false},{"$f":"IF($C92,data!D68,NA())","v":{"$error":"#N/A"}},{"$f":"IF($C92,data!E68,NA())","v":{"$error":"#N/A"}},{"$f":"IF($C92,data!F68,0)","v":0}]
[null,{"$f":"data!B69","v":"Düsseldorf"},{"$f":"CHOOSE(mySelectionType,\nSQRT((data!D69-control!$C$8)^2+(myAspectRatio*(data!E69-control!$C$9))^2)<=control!$C$17,\nAND(data!D69<=control!$C$8,data!E69>=control!$C$9,data!D69>=control!$C$10,data!E69<=control!$C$11))","v":false},{"$f":"IF($C93,data!D69,NA())","v":{"$error":"#N/A"}},{"$f":"IF($C93,data!E69,NA())","v":{"$error":"#N/A"}},{"$f":"IF($C93,data!F69,0)","v":0}]
[null,{"$f":"data!B70","v":"Poznań"},{"$f":"CHOOSE(mySelectionType,\nSQRT((data!D70-control!$C$8)^2+(myAspectRatio*(data!E70-control!$C$9))^2)<=control!$C$17,\nAND(data!D70<=control!$C$8,data!E70>=control!$C$9,data!D70>=control!$C$10,data!E70<=control!$C$11))","v":true},{"$f":"IF($C94,data!D70,NA())","v":52.40692},{"$f":"IF($C94,data!E70,NA())","v":16.929929999999999},{"$f":"IF($C94,data!F70,0)","v":570352}]
[null,{"$f":"data!B71","v":"Málaga"},{"$f":"CHOOSE(mySelectionType,\nSQRT((data!D71-control!$C$8)^2+(myAspectRatio*(data!E71-control!$C$9))^2)<=control!$C$17,\nAND(data!D71<=control!$C$8,data!E71>=control!$C$9,data!D71>=control!$C$10,data!E71<=control!$C$11))","v":false},{"$f":"IF($C95,data!D71,NA())","v":{"$error":"#N/A"}},{"$f":"IF($C95,data!E71,NA())","v":{"$error":"#N/A"}},{"$f":"IF($C95,data!F71,0)","v":0}]
[null,{"$f":"data!B72","v":"Helsinki"},{"$f":"CHOOSE(mySelectionType,\nSQRT((data!D72-control!$C$8)^2+(myAspectRatio*(data!E72-control!$C$9))^2)<=control!$C$17,\nAND(data!D72<=control!$C$8,data!E72>=control!$C$9,data!D72>=control!$C$10,data!E72<=control!$C$11))","v":true},{"$f":"IF($C96,data!D72,NA())","v":60.169519999999999},{"$f":"IF($C96,data!E72,NA())","v":24.935449999999999},{"$f":"IF($C96,data!F72,0)","v":558457}]
[null,{"$f":"data!B73","v":"Pristina"},{"$f":"CHOOSE(mySelectionType,\nSQRT((data!D73-control!$C$8)^2+(myAspectRatio*(data!E73-control!$C$9))^2)<=control!$C$17,\nAND(data!D73<=control!$C$8,data!E73>=control!$C$9,data!D73>=control!$C$10,data!E73<=control!$C$11))","v":true},{"$f":"IF($C97,data!D73,NA())","v":42.672719999999998},{"$f":"IF($C97,data!E73,NA())","v":21.166879999999999},{"$f":"IF($C97,data!F73,0)","v":550000}]
[null,{"$f":"data!B74","v":"Bremen"},{"$f":"CHOOSE(mySelectionType,\nSQRT((data!D74-control!$C$8)^2+(myAspectRatio*(data!E74-control!$C$9))^2)<=control!$C$17,\nAND(data!D74<=control!$C$8,data!E74>=control!$C$9,data!D74>=control!$C$10,data!E74<=control!$C$11))","v":true},{"$f":"IF($C98,data!D74,NA())","v":53.075159999999997},{"$f":"IF($C98,data!E74,NA())","v":8.8077699999999997},{"$f":"IF($C98,data!F74,0)","v":546501}]
[null,{"$f":"data!B75","v":"Vilnius"},{"$f":"CHOOSE(mySelectionType,\nSQRT((data!D75-control!$C$8)^2+(myAspectRatio*(data!E75-control!$C$9))^2)<=control!$C$17,\nAND(data!D75<=control!$C$8,data!E75>=control!$C$9,data!D75>=control!$C$10,data!E75<=control!$C$11))","v":true},{"$f":"IF($C99,data!D75,NA())","v":54.689160000000001},{"$f":"IF($C99,data!E75,NA())","v":25.279800000000002},{"$f":"IF($C99,data!F75,0)","v":542366}]
[null,{"$f":"data!B76","v":"Mercin"},{"$f":"CHOOSE(mySelectionType,\nSQRT((data!D76-control!$C$8)^2+(myAspectRatio*(data!E76-control!$C$9))^2)<=control!$C$17,\nAND(data!D76<=control!$C$8,data!E76>=control!$C$9,data!D76>=control!$C$10,data!E76<=control!$C$11))","v":false},{"$f":"IF($C100,data!D76,NA())","v":{"$error":"#N/A"}},{"$f":"IF($C100,data!E76,NA())","v":{"$error":"#N/A"}},{"$f":"IF($C100,data!F76,0)","v":0}]
[null,{"$f":"data!B77","v":"Lisbon"},{"$f":"CHOOSE(mySelectionType,\nSQRT((data!D77-control!$C$8)^2+(myAspectRatio*(data!E77-control!$C$9))^2)<=control!$C$17,\nAND(data!D77<=control!$C$8,data!E77>=control!$C$9,data!D77>=control!$C$10,data!E77<=control!$C$11))","v":false},{"$f":"IF($C101,data!D77,NA())","v":{"$error":"#N/A"}},{"$f":"IF($C101,data!E77,NA())","v":{"$error":"#N/A"}},{"$f":"IF($C101,data!F77,0)","v":0}]
[null,{"$f":"data!B78","v":"Hannover"},{"$f":"CHOOSE(mySelectionType,\nSQRT((data!D78-control!$C$8)^2+(myAspectRatio*(data!E78-control!$C$9))^2)<=control!$C$17,\nAND(data!D78<=control!$C$8,data!E78>=control!$C$9,data!D78>=control!$C$10,data!E78<=control!$C$11))","v":true},{"$f":"IF($C102,data!D78,NA())","v":52.370519999999999},{"$f":"IF($C102,data!E78,NA())","v":9.7332199999999993},{"$f":"IF($C102,data!F78,0)","v":515140}]
[null,{"$f":"data!B79","v":"Eskişehir"},{"$f":"CHOOSE(mySelectionType,\nSQRT((data!D79-control!$C$8)^2+(myAspectRatio*(data!E79-control!$C$9))^2)<=control!$C$17,\nAND(data!D79<=control!$C$8,data!E79>=control!$C$9,data!D79>=control!$C$10,data!E79<=control!$C$11))","v":false},{"$f":"IF($C103,data!D79,NA())","v":{"$error":"#N/A"}},{"$f":"IF($C103,data!E79,NA())","v":{"$error":"#N/A"}},{"$f":"IF($C103,data!F79,0)","v":0}]
[null,{"$f":"data!B80","v":"Mykolayiv"},{"$f":"CHOOSE(mySelectionType,\nSQRT((data!D80-control!$C$8)^2+(myAspectRatio*(data!E80-control!$C$9))^2)<=control!$C$17,\nAND(data!D80<=control!$C$8,data!E80>=control!$C$9,data!D80>=control!$C$10,data!E80<=control!$C$11))","v":true},{"$f":"IF($C104,data!D80,NA())","v":46.965910000000001},{"$f":"IF($C104,data!E80,NA())","v":31.997399999999999},{"$f":"IF($C104,data!F80,0)","v":510840}]
[null,{"$f":"data!B81","v":"Leipzig"},{"$f":"CHOOSE(mySelectionType,\nSQRT((data!D81-control!$C$8)^2+(myAspectRatio*(data!E81-control!$C$9))^2)<=control!$C$17,\nAND(data!D81<=control!$C$8,data!E81>=control!$C$9,data!D81>=control!$C$10,data!E81<=control!$C$11))","v":true},{"$f":"IF($C105,data!D81,NA())","v":51.339619999999996},{"$f":"IF($C105,data!E81,NA())","v":12.37129},{"$f":"IF($C105,data!F81,0)","v":504971}]
[null,{"$f":"data!B82","v":"Duisburg"},{"$f":"CHOOSE(mySelectionType,\nSQRT((data!D82-control!$C$8)^2+(myAspectRatio*(data!E82-control!$C$9))^2)<=control!$C$17,\nAND(data!D82<=control!$C$8,data!E82>=control!$C$9,data!D82>=control!$C$10,data!E82<=control!$C$11))","v":false},{"$f":"IF($C106,data!D82,NA())","v":{"$error":"#N/A"}},{"$f":"IF($C106,data!E82,NA())","v":{"$error":"#N/A"}},{"$f":"IF($C106,data!F82,0)","v":0}]
[null,{"$f":"data!B83","v":"Göteborg"},{"$f":"CHOOSE(mySelectionType,\nSQRT((data!D83-control!$C$8)^2+(myAspectRatio*(data!E83-control!$C$9))^2)<=control!$C$17,\nAND(data!D83<=control!$C$8,data!E83>=control!$C$9,data!D83>=control!$C$10,data!E83<=control!$C$11))","v":false},{"$f":"IF($C107,data!D83,NA())","v":{"$error":"#N/A"}},{"$f":"IF($C107,data!E83,NA())","v":{"$error":"#N/A"}},{"$f":"IF($C107,data!F83,0)","v":0}]
[null,{"$f":"data!B84","v":"Nürnberg"},{"$f":"CHOOSE(mySelectionType,\nSQRT((data!D84-control!$C$8)^2+(myAspectRatio*(data!E84-control!$C$9))^2)<=control!$C$17,\nAND(data!D84<=control!$C$8,data!E84>=control!$C$9,data!D84>=control!$C$10,data!E84<=control!$C$11))","v":true},{"$f":"IF($C108,data!D84,NA())","v":49.454210000000003},{"$f":"IF($C108,data!E84,NA())","v":11.07752},{"$f":"IF($C108,data!F84,0)","v":499237}]
[null,{"$f":"data!B85","v":"Dresden"},{"$f":"CHOOSE(mySelectionType,\nSQRT((data!D85-control!$C$8)^2+(myAspectRatio*(data!E85-control!$C$9))^2)<=control!$C$17,\nAND(data!D85<=control!$C$8,data!E85>=control!$C$9,data!D85>=control!$C$10,data!E85<=control!$C$11))","v":true},{"$f":"IF($C109,data!D85,NA())","v":51.050890000000003},{"$f":"IF($C109,data!E85,NA())","v":13.73832},{"$f":"IF($C109,data!F85,0)","v":486854}]
[null,{"$f":"data!B86","v":"Mariupol"},{"$f":"CHOOSE(mySelectionType,\nSQRT((data!D86-control!$C$8)^2+(myAspectRatio*(data!E86-control!$C$9))^2)<=control!$C$17,\nAND(data!D86<=control!$C$8,data!E86>=control!$C$9,data!D86>=control!$C$10,data!E86<=control!$C$11))","v":false},{"$f":"IF($C110,data!D86,NA())","v":{"$error":"#N/A"}},{"$f":"IF($C110,data!E86,NA())","v":{"$error":"#N/A"}},{"$f":"IF($C110,data!F86,0)","v":0}]
[null,{"$f":"data!B87","v":"Gomel"},{"$f":"CHOOSE(mySelectionType,\nSQRT((data!D87-control!$C$8)^2+(myAspectRatio*(data!E87-control!$C$9))^2)<=control!$C$17,\nAND(data!D87<=control!$C$8,data!E87>=control!$C$9,data!D87>=control!$C$10,data!E87<=control!$C$11))","v":true},{"$f":"IF($C111,data!D87,NA())","v":52.4345},{"$f":"IF($C111,data!E87,NA())","v":30.9754},{"$f":"IF($C111,data!F87,0)","v":480951}]
[null,{"$f":"data!B88","v":"Skopje"},{"$f":"CHOOSE(mySelectionType,\nSQRT((data!D88-control!$C$8)^2+(myAspectRatio*(data!E88-control!$C$9))^2)<=control!$C$17,\nAND(data!D88<=control!$C$8,data!E88>=control!$C$9,data!D88>=control!$C$10,data!E88<=control!$C$11))","v":true},{"$f":"IF($C112,data!D88,NA())","v":41.996459999999999},{"$f":"IF($C112,data!E88,NA())","v":21.43141},{"$f":"IF($C112,data!F88,0)","v":474889}]
[null,{"$f":"data!B89","v":"The Hague"},{"$f":"CHOOSE(mySelectionType,\nSQRT((data!D89-control!$C$8)^2+(myAspectRatio*(data!E89-control!$C$9))^2)<=control!$C$17,\nAND(data!D89<=control!$C$8,data!E89>=control!$C$9,data!D89>=control!$C$10,data!E89<=control!$C$11))","v":false},{"$f":"IF($C113,data!D89,NA())","v":{"$error":"#N/A"}},{"$f":"IF($C113,data!E89,NA())","v":{"$error":"#N/A"}},{"$f":"IF($C113,data!F89,0)","v":0}]
[null,{"$f":"data!B90","v":"Lyon"},{"$f":"CHOOSE(mySelectionType,\nSQRT((data!D90-control!$C$8)^2+(myAspectRatio*(data!E90-control!$C$9))^2)<=control!$C$17,\nAND(data!D90<=control!$C$8,data!E90>=control!$C$9,data!D90>=control!$C$10,data!E90<=control!$C$11))","v":false},{"$f":"IF($C114,data!D90,NA())","v":{"$error":"#N/A"}},{"$f":"IF($C114,data!E90,NA())","v":{"$error":"#N/A"}},{"$f":"IF($C114,data!F90,0)","v":0}]
[null,{"$f":"data!B91","v":"Liverpool"},{"$f":"CHOOSE(mySelectionType,\nSQRT((data!D91-control!$C$8)^2+(myAspectRatio*(data!E91-control!$C$9))^2)<=control!$C$17,\nAND(data!D91<=control!$C$8,data!E91>=control!$C$9,data!D91>=control!$C$10,data!E91<=control!$C$11))","v":false},{"$f":"IF($C115,data!D91,NA())","v":{"$error":"#N/A"}},{"$f":"IF($C115,data!E91,NA())","v":{"$error":"#N/A"}},{"$f":"IF($C115,data!F91,0)","v":0}]
[null,{"$f":"data!B92","v":"Gdańsk"},{"$f":"CHOOSE(mySelectionType,\nSQRT((data!D92-control!$C$8)^2+(myAspectRatio*(data!E92-control!$C$9))^2)<=control!$C$17,\nAND(data!D92<=control!$C$8,data!E92>=control!$C$9,data!D92>=control!$C$10,data!E92<=control!$C$11))","v":true},{"$f":"IF($C116,data!D92,NA())","v":54.352049999999998},{"$f":"IF($C116,data!E92,NA())","v":18.646370000000001},{"$f":"IF($C116,data!F92,0)","v":461865}]
[null,{"$f":"data!B93","v":"Antwerpen"},{"$f":"CHOOSE(mySelectionType,\nSQRT((data!D93-control!$C$8)^2+(myAspectRatio*(data!E93-control!$C$9))^2)<=control!$C$17,\nAND(data!D93<=control!$C$8,data!E93>=control!$C$9,data!D93>=control!$C$10,data!E93<=control!$C$11))","v":false},{"$f":"IF($C117,data!D93,NA())","v":{"$error":"#N/A"}},{"$f":"IF($C117,data!E93,NA())","v":{"$error":"#N/A"}},{"$f":"IF($C117,data!F93,0)","v":0}]
[null,{"$f":"data!B94","v":"Leeds"},{"$f":"CHOOSE(mySelectionType,\nSQRT((data!D94-control!$C$8)^2+(myAspectRatio*(data!E94-control!$C$9))^2)<=control!$C$17,\nAND(data!D94<=control!$C$8,data!E94>=control!$C$9,data!D94>=control!$C$10,data!E94<=control!$C$11))","v":false},{"$f":"IF($C118,data!D94,NA())","v":{"$error":"#N/A"}},{"$f":"IF($C118,data!E94,NA())","v":{"$error":"#N/A"}},{"$f":"IF($C118,data!F94,0)","v":0}]
[null,{"$f":"data!B95","v":"Luhansk"},{"$f":"CHOOSE(mySelectionType,\nSQRT((data!D95-control!$C$8)^2+(myAspectRatio*(data!E95-control!$C$9))^2)<=control!$C$17,\nAND(data!D95<=control!$C$8,data!E95>=control!$C$9,data!D95>=control!$C$10,data!E95<=control!$C$11))","v":false},{"$f":"IF($C119,data!D95,NA())","v":{"$error":"#N/A"}},{"$f":"IF($C119,data!E95,NA())","v":{"$error":"#N/A"}},{"$f":"IF($C119,data!F95,0)","v":0}]
[null,{"$f":"data!B96","v":"Şanlıurfa"},{"$f":"CHOOSE(mySelectionType,\nSQRT((data!D96-control!$C$8)^2+(myAspectRatio*(data!E96-control!$C$9))^2)<=control!$C$17,\nAND(data!D96<=control!$C$8,data!E96>=control!$C$9,data!D96>=control!$C$10,data!E96<=control!$C$11))","v":false},{"$f":"IF($C120,data!D96,NA())","v":{"$error":"#N/A"}},{"$f":"IF($C120,data!E96,NA())","v":{"$error":"#N/A"}},{"$f":"IF($C120,data!F96,0)","v":0}]
[null,{"$f":"data!B97","v":"Sheffield"},{"$f":"CHOOSE(mySelectionType,\nSQRT((data!D97-control!$C$8)^2+(myAspectRatio*(data!E97-control!$C$9))^2)<=control!$C$17,\nAND(data!D97<=control!$C$8,data!E97>=control!$C$9,data!D97>=control!$C$10,data!E97<=control!$C$11))","v":false},{"$f":"IF($C121,data!D97,NA())","v":{"$error":"#N/A"}},{"$f":"IF($C121,data!E97,NA())","v":{"$error":"#N/A"}},{"$f":"IF($C121,data!F97,0)","v":0}]
[null,{"$f":"data!B98","v":"Malatya"},{"$f":"CHOOSE(mySelectionType,\nSQRT((data!D98-control!$C$8)^2+(myAspectRatio*(data!E98-control!$C$9))^2)<=control!$C$17,\nAND(data!D98<=control!$C$8,data!E98>=control!$C$9,data!D98>=control!$C$10,data!E98<=control!$C$11))","v":false},{"$f":"IF($C122,data!D98,NA())","v":{"$error":"#N/A"}},{"$f":"IF($C122,data!E98,NA())","v":{"$error":"#N/A"}},{"$f":"IF($C122,data!F98,0)","v":0}]
[null,{"$f":"data!B99","v":"Murcia"},{"$f":"CHOOSE(mySelectionType,\nSQRT((data!D99-control!$C$8)^2+(myAspectRatio*(data!E99-control!$C$9))^2)<=control!$C$17,\nAND(data!D99<=control!$C$8,data!E99>=control!$C$9,data!D99>=control!$C$10,data!E99<=control!$C$11))","v":false},{"$f":"IF($C123,data!D99,NA())","v":{"$error":"#N/A"}},{"$f":"IF($C123,data!E99,NA())","v":{"$error":"#N/A"}},{"$f":"IF($C123,data!F99,0)","v":0}]
[null,{"$f":"data!B100","v":"Edinburgh"},{"$f":"CHOOSE(mySelectionType,\nSQRT((data!D100-control!$C$8)^2+(myAspectRatio*(data!E100-control!$C$9))^2)<=control!$C$17,\nAND(data!D100<=control!$C$8,data!E100>=control!$C$9,data!D100>=control!$C$10,data!E100<=control!$C$11))","v":false},{"$f":"IF($C124,data!D100,NA())","v":{"$error":"#N/A"}},{"$f":"IF($C124,data!E100,NA())","v":{"$error":"#N/A"}},{"$f":"IF($C124,data!F100,0)","v":0}]
[null,{"$f":"data!B101","v":"Toulouse"},{"$f":"CHOOSE(mySelectionType,\nSQRT((data!D101-control!$C$8)^2+(myAspectRatio*(data!E101-control!$C$9))^2)<=control!$C$17,\nAND(data!D101<=control!$C$8,data!E101>=control!$C$9,data!D101>=control!$C$10,data!E101<=control!$C$11))","v":false},{"$f":"IF($C125,data!D101,NA())","v":{"$error":"#N/A"}},{"$f":"IF($C125,data!E101,NA())","v":{"$error":"#N/A"}},{"$f":"IF($C125,data!F101,0)","v":0}]
[null,{"$f":"data!B102","v":"Bristol"},{"$f":"CHOOSE(mySelectionType,\nSQRT((data!D102-control!$C$8)^2+(myAspectRatio*(data!E102-control!$C$9))^2)<=control!$C$17,\nAND(data!D102<=control!$C$8,data!E102>=control!$C$9,data!D102>=control!$C$10,data!E102<=control!$C$11))","v":false},{"$f":"IF($C126,data!D102,NA())","v":{"$error":"#N/A"}},{"$f":"IF($C126,data!E102,NA())","v":{"$error":"#N/A"}},{"$f":"IF($C126,data!F102,0)","v":0}]
[null,{"$f":"data!B103","v":"Bratislava"},{"$f":"CHOOSE(mySelectionType,\nSQRT((data!D103-control!$C$8)^2+(myAspectRatio*(data!E103-control!$C$9))^2)<=control!$C$17,\nAND(data!D103<=control!$C$8,data!E103>=control!$C$9,data!D103>=control!$C$10,data!E103<=control!$C$11))","v":true},{"$f":"IF($C127,data!D103,NA())","v":48.148159999999997},{"$f":"IF($C127,data!E103,NA())","v":17.106739999999999},{"$f":"IF($C127,data!F103,0)","v":423737}]
[null,{"$f":"data!B104","v":"Szczecin"},{"$f":"CHOOSE(mySelectionType,\nSQRT((data!D104-control!$C$8)^2+(myAspectRatio*(data!E104-control!$C$9))^2)<=control!$C$17,\nAND(data!D104<=control!$C$8,data!E104>=control!$C$9,data!D104>=control!$C$10,data!E104<=control!$C$11))","v":true},{"$f":"IF($C128,data!D104,NA())","v":53.428939999999997},{"$f":"IF($C128,data!E104,NA())","v":14.55302},{"$f":"IF($C128,data!F104,0)","v":407811}]
[null,{"$f":"data!B105","v":"Palma"},{"$f":"CHOOSE(mySelectionType,\nSQRT((data!D105-control!$C$8)^2+(myAspectRatio*(data!E105-control!$C$9))^2)<=control!$C$17,\nAND(data!D105<=control!$C$8,data!E105>=control!$C$9,data!D105>=control!$C$10,data!E105<=control!$C$11))","v":false},{"$f":"IF($C129,data!D105,NA())","v":{"$error":"#N/A"}},{"$f":"IF($C129,data!E105,NA())","v":{"$error":"#N/A"}},{"$f":"IF($C129,data!F105,0)","v":0}]
[null,{"$f":"data!B106","v":"Khmel’nyts’kyy"},{"$f":"CHOOSE(mySelectionType,\nSQRT((data!D106-control!$C$8)^2+(myAspectRatio*(data!E106-control!$C$9))^2)<=control!$C$17,\nAND(data!D106<=control!$C$8,data!E106>=control!$C$9,data!D106>=control!$C$10,data!E106<=control!$C$11))","v":true},{"$f":"IF($C130,data!D106,NA())","v":49.421610000000001},{"$f":"IF($C130,data!E106,NA())","v":26.99653},{"$f":"IF($C130,data!F106,0)","v":398346}]
[null,{"$f":"data!B107","v":"Manchester"},{"$f":"CHOOSE(mySelectionType,\nSQRT((data!D107-control!$C$8)^2+(myAspectRatio*(data!E107-control!$C$9))^2)<=control!$C$17,\nAND(data!D107<=control!$C$8,data!E107>=control!$C$9,data!D107>=control!$C$10,data!E107<=control!$C$11))","v":false},{"$f":"IF($C131,data!D107,NA())","v":{"$error":"#N/A"}},{"$f":"IF($C131,data!E107,NA())","v":{"$error":"#N/A"}},{"$f":"IF($C131,data!F107,0)","v":0}]
[null,{"$f":"data!B108","v":"Samsun"},{"$f":"CHOOSE(mySelectionType,\nSQRT((data!D108-control!$C$8)^2+(myAspectRatio*(data!E108-control!$C$9))^2)<=control!$C$17,\nAND(data!D108<=control!$C$8,data!E108>=control!$C$9,data!D108>=control!$C$10,data!E108<=control!$C$11))","v":false},{"$f":"IF($C132,data!D108,NA())","v":{"$error":"#N/A"}},{"$f":"IF($C132,data!E108,NA())","v":{"$error":"#N/A"}},{"$f":"IF($C132,data!F108,0)","v":0}]
[null,{"$f":"data!B109","v":"Tallinn"},{"$f":"CHOOSE(mySelectionType,\nSQRT((data!D109-control!$C$8)^2+(myAspectRatio*(data!E109-control!$C$9))^2)<=control!$C$17,\nAND(data!D109<=control!$C$8,data!E109>=control!$C$9,data!D109>=control!$C$10,data!E109<=control!$C$11))","v":true},{"$f":"IF($C133,data!D109,NA())","v":59.436959999999999},{"$f":"IF($C133,data!E109,NA())","v":24.753530000000001},{"$f":"IF($C133,data!F109,0)","v":394024}]
[null,{"$f":"data!B110","v":"Bochum"},{"$f":"CHOOSE(mySelectionType,\nSQRT((data!D110-control!$C$8)^2+(myAspectRatio*(data!E110-control!$C$9))^2)<=control!$C$17,\nAND(data!D110<=control!$C$8,data!E110>=control!$C$9,data!D110>=control!$C$10,data!E110<=control!$C$11))","v":false},{"$f":"IF($C134,data!D110,NA())","v":{"$error":"#N/A"}},{"$f":"IF($C134,data!E110,NA())","v":{"$error":"#N/A"}},{"$f":"IF($C134,data!F110,0)","v":0}]
[null,{"$f":"data!B111","v":"Bochum-Hordel"},{"$f":"CHOOSE(mySelectionType,\nSQRT((data!D111-control!$C$8)^2+(myAspectRatio*(data!E111-control!$C$9))^2)<=control!$C$17,\nAND(data!D111<=control!$C$8,data!E111>=control!$C$9,data!D111>=control!$C$10,data!E111<=control!$C$11))","v":false},{"$f":"IF($C135,data!D111,NA())","v":{"$error":"#N/A"}},{"$f":"IF($C135,data!E111,NA())","v":{"$error":"#N/A"}},{"$f":"IF($C135,data!F111,0)","v":0}]
[null,{"$f":"data!B112","v":"Sevastopol"},{"$f":"CHOOSE(mySelectionType,\nSQRT((data!D112-control!$C$8)^2+(myAspectRatio*(data!E112-control!$C$9))^2)<=control!$C$17,\nAND(data!D112<=control!$C$8,data!E112>=control!$C$9,data!D112>=control!$C$10,data!E112<=control!$C$11))","v":true},{"$f":"IF($C136,data!D112,NA())","v":44.588830000000002},{"$f":"IF($C136,data!E112,NA())","v":33.522399999999998},{"$f":"IF($C136,data!F112,0)","v":379200}]
[null,{"$f":"data!B113","v":"Makiyivka"},{"$f":"CHOOSE(mySelectionType,\nSQRT((data!D113-control!$C$8)^2+(myAspectRatio*(data!E113-control!$C$9))^2)<=control!$C$17,\nAND(data!D113<=control!$C$8,data!E113>=control!$C$9,data!D113>=control!$C$10,data!E113<=control!$C$11))","v":false},{"$f":"IF($C137,data!D113,NA())","v":{"$error":"#N/A"}},{"$f":"IF($C137,data!E113,NA())","v":{"$error":"#N/A"}},{"$f":"IF($C137,data!F113,0)","v":0}]
[null,{"$f":"data!B114","v":"Kahramanmaraş"},{"$f":"CHOOSE(mySelectionType,\nSQRT((data!D114-control!$C$8)^2+(myAspectRatio*(data!E114-control!$C$9))^2)<=control!$C$17,\nAND(data!D114<=control!$C$8,data!E114>=control!$C$9,data!D114>=control!$C$10,data!E114<=control!$C$11))","v":false},{"$f":"IF($C138,data!D114,NA())","v":{"$error":"#N/A"}},{"$f":"IF($C138,data!E114,NA())","v":{"$error":"#N/A"}},{"$f":"IF($C138,data!F114,0)","v":0}]
[null,{"$f":"data!B115","v":"Tirana"},{"$f":"CHOOSE(mySelectionType,\nSQRT((data!D115-control!$C$8)^2+(myAspectRatio*(data!E115-control!$C$9))^2)<=control!$C$17,\nAND(data!D115<=control!$C$8,data!E115>=control!$C$9,data!D115>=control!$C$10,data!E115<=control!$C$11))","v":true},{"$f":"IF($C139,data!D115,NA())","v":41.327500000000001},{"$f":"IF($C139,data!E115,NA())","v":19.81889},{"$f":"IF($C139,data!F115,0)","v":374801}]
[null,{"$f":"data!B116","v":"Kaunas"},{"$f":"CHOOSE(mySelectionType,\nSQRT((data!D116-control!$C$8)^2+(myAspectRatio*(data!E116-control!$C$9))^2)<=control!$C$17,\nAND(data!D116<=control!$C$8,data!E116>=control!$C$9,data!D116>=control!$C$10,data!E116<=control!$C$11))","v":true},{"$f":"IF($C140,data!D116,NA())","v":54.9},{"$f":"IF($C140,data!E116,NA())","v":23.9},{"$f":"IF($C140,data!F116,0)","v":374643}]
[null,{"$f":"data!B117","v":"Brno"},{"$f":"CHOOSE(mySelectionType,\nSQRT((data!D117-control!$C$8)^2+(myAspectRatio*(data!E117-control!$C$9))^2)<=control!$C$17,\nAND(data!D117<=control!$C$8,data!E117>=control!$C$9,data!D117>=control!$C$10,data!E117<=control!$C$11))","v":true},{"$f":"IF($C141,data!D117,NA())","v":49.195219999999999},{"$f":"IF($C141,data!E117,NA())","v":16.607959999999999},{"$f":"IF($C141,data!F117,0)","v":369559}]
[null,{"$f":"data!B118","v":"Mahilyow"},{"$f":"CHOOSE(mySelectionType,\nSQRT((data!D118-control!$C$8)^2+(myAspectRatio*(data!E118-control!$C$9))^2)<=control!$C$17,\nAND(data!D118<=control!$C$8,data!E118>=control!$C$9,data!D118>=control!$C$10,data!E118<=control!$C$11))","v":true},{"$f":"IF($C142,data!D118,NA())","v":53.916800000000002},{"$f":"IF($C142,data!E118,NA())","v":30.344899999999999},{"$f":"IF($C142,data!F118,0)","v":369200}]
[null,{"$f":"data!B119","v":"Bydgoszcz"},{"$f":"CHOOSE(mySelectionType,\nSQRT((data!D119-control!$C$8)^2+(myAspectRatio*(data!E119-control!$C$9))^2)<=control!$C$17,\nAND(data!D119<=control!$C$8,data!E119>=control!$C$9,data!D119>=control!$C$10,data!E119<=control!$C$11))","v":true},{"$f":"IF($C143,data!D119,NA())","v":53.1235},{"$f":"IF($C143,data!E119,NA())","v":18.007619999999999},{"$f":"IF($C143,data!F119,0)","v":366452}]
[null,{"$f":"data!B120","v":"Bologna"},{"$f":"CHOOSE(mySelectionType,\nSQRT((data!D120-control!$C$8)^2+(myAspectRatio*(data!E120-control!$C$9))^2)<=control!$C$17,\nAND(data!D120<=control!$C$8,data!E120>=control!$C$9,data!D120>=control!$C$10,data!E120<=control!$C$11))","v":true},{"$f":"IF($C144,data!D120,NA())","v":44.493810000000003},{"$f":"IF($C144,data!E120,NA())","v":11.338749999999999},{"$f":"IF($C144,data!F120,0)","v":366133}]
[null,{"$f":"data!B121","v":"Wuppertal"},{"$f":"CHOOSE(mySelectionType,\nSQRT((data!D121-control!$C$8)^2+(myAspectRatio*(data!E121-control!$C$9))^2)<=control!$C$17,\nAND(data!D121<=control!$C$8,data!E121>=control!$C$9,data!D121>=control!$C$10,data!E121<=control!$C$11))","v":false},{"$f":"IF($C145,data!D121,NA())","v":{"$error":"#N/A"}},{"$f":"IF($C145,data!E121,NA())","v":{"$error":"#N/A"}},{"$f":"IF($C145,data!F121,0)","v":0}]
[null,{"$f":"data!B122","v":"Lublin"},{"$f":"CHOOSE(mySelectionType,\nSQRT((data!D122-control!$C$8)^2+(myAspectRatio*(data!E122-control!$C$9))^2)<=control!$C$17,\nAND(data!D122<=control!$C$8,data!E122>=control!$C$9,data!D122>=control!$C$10,data!E122<=control!$C$11))","v":true},{"$f":"IF($C146,data!D122,NA())","v":51.25},{"$f":"IF($C146,data!E122,NA())","v":22.566669999999998},{"$f":"IF($C146,data!F122,0)","v":360044}]
[null,{"$f":"data!B123","v":"Simferopol"},{"$f":"CHOOSE(mySelectionType,\nSQRT((data!D123-control!$C$8)^2+(myAspectRatio*(data!E123-control!$C$9))^2)<=control!$C$17,\nAND(data!D123<=control!$C$8,data!E123>=control!$C$9,data!D123>=control!$C$10,data!E123<=control!$C$11))","v":true},{"$f":"IF($C147,data!D123,NA())","v":44.957189999999997},{"$f":"IF($C147,data!E123,NA())","v":34.110790000000001},{"$f":"IF($C147,data!F123,0)","v":358108}]
[null,{"$f":"data!B124","v":"Bilbao"},{"$f":"CHOOSE(mySelectionType,\nSQRT((data!D124-control!$C$8)^2+(myAspectRatio*(data!E124-control!$C$9))^2)<=control!$C$17,\nAND(data!D124<=control!$C$8,data!E124>=control!$C$9,data!D124>=control!$C$10,data!E124<=control!$C$11))","v":false},{"$f":"IF($C148,data!D124,NA())","v":{"$error":"#N/A"}},{"$f":"IF($C148,data!E124,NA())","v":{"$error":"#N/A"}},{"$f":"IF($C148,data!F124,0)","v":0}]
[null,{"$f":"data!B125","v":"Thessaloníki"},{"$f":"CHOOSE(mySelectionType,\nSQRT((data!D125-control!$C$8)^2+(myAspectRatio*(data!E125-control!$C$9))^2)<=control!$C$17,\nAND(data!D125<=control!$C$8,data!E125>=control!$C$9,data!D125>=control!$C$10,data!E125<=control!$C$11))","v":true},{"$f":"IF($C149,data!D125,NA())","v":40.643610000000002},{"$f":"IF($C149,data!E125,NA())","v":22.930859999999999},{"$f":"IF($C149,data!F125,0)","v":354290}]
[null,{"$f":"data!B126","v":"Vinnytsya"},{"$f":"CHOOSE(mySelectionType,\nSQRT((data!D126-control!$C$8)^2+(myAspectRatio*(data!E126-control!$C$9))^2)<=control!$C$17,\nAND(data!D126<=control!$C$8,data!E126>=control!$C$9,data!D126>=control!$C$10,data!E126<=control!$C$11))","v":true},{"$f":"IF($C150,data!D126,NA())","v":49.232779999999998},{"$f":"IF($C150,data!E126,NA())","v":28.480969999999999},{"$f":"IF($C150,data!F126,0)","v":352115}]
[null,{"$f":"data!B127","v":"Florence"},{"$f":"CHOOSE(mySelectionType,\nSQRT((data!D127-control!$C$8)^2+(myAspectRatio*(data!E127-control!$C$9))^2)<=control!$C$17,\nAND(data!D127<=control!$C$8,data!E127>=control!$C$9,data!D127>=control!$C$10,data!E127<=control!$C$11))","v":true},{"$f":"IF($C151,data!D127,NA())","v":43.779249999999998},{"$f":"IF($C151,data!E127,NA())","v":11.246259999999999},{"$f":"IF($C151,data!F127,0)","v":349296}]
[null,{"$f":"data!B128","v":"Vitebsk"},{"$f":"CHOOSE(mySelectionType,\nSQRT((data!D128-control!$C$8)^2+(myAspectRatio*(data!E128-control!$C$9))^2)<=control!$C$17,\nAND(data!D128<=control!$C$8,data!E128>=control!$C$9,data!D128>=control!$C$10,data!E128<=control!$C$11))","v":true},{"$f":"IF($C152,data!D128,NA())","v":55.190399999999997},{"$f":"IF($C152,data!E128,NA())","v":30.204899999999999},{"$f":"IF($C152,data!F128,0)","v":342700}]
[null,{"$f":"data!B129","v":"Zürich"},{"$f":"CHOOSE(mySelectionType,\nSQRT((data!D129-control!$C$8)^2+(myAspectRatio*(data!E129-control!$C$9))^2)<=control!$C$17,\nAND(data!D129<=control!$C$8,data!E129>=control!$C$9,data!D129>=control!$C$10,data!E129<=control!$C$11))","v":true},{"$f":"IF($C153,data!D129,NA())","v":47.366669999999999},{"$f":"IF($C153,data!E129,NA())","v":8.5500000000000007},{"$f":"IF($C153,data!F129,0)","v":341730}]
[null,{"$f":"data!B130","v":"Plovdiv"},{"$f":"CHOOSE(mySelectionType,\nSQRT((data!D130-control!$C$8)^2+(myAspectRatio*(data!E130-control!$C$9))^2)<=control!$C$17,\nAND(data!D130<=control!$C$8,data!E130>=control!$C$9,data!D130>=control!$C$10,data!E130<=control!$C$11))","v":true},{"$f":"IF($C154,data!D130,NA())","v":42.15},{"$f":"IF($C154,data!E130,NA())","v":24.75},{"$f":"IF($C154,data!F130,0)","v":340494}]
[null,{"$f":"data!B131","v":"Leicester"},{"$f":"CHOOSE(mySelectionType,\nSQRT((data!D131-control!$C$8)^2+(myAspectRatio*(data!E131-control!$C$9))^2)<=control!$C$17,\nAND(data!D131<=control!$C$8,data!E131>=control!$C$9,data!D131>=control!$C$10,data!E131<=control!$C$11))","v":false},{"$f":"IF($C155,data!D131,NA())","v":{"$error":"#N/A"}},{"$f":"IF($C155,data!E131,NA())","v":{"$error":"#N/A"}},{"$f":"IF($C155,data!F131,0)","v":0}]
[null,{"$f":"data!B132","v":"Nice"},{"$f":"CHOOSE(mySelectionType,\nSQRT((data!D132-control!$C$8)^2+(myAspectRatio*(data!E132-control!$C$9))^2)<=control!$C$17,\nAND(data!D132<=control!$C$8,data!E132>=control!$C$9,data!D132>=control!$C$10,data!E132<=control!$C$11))","v":false},{"$f":"IF($C156,data!D132,NA())","v":{"$error":"#N/A"}},{"$f":"IF($C156,data!E132,NA())","v":{"$error":"#N/A"}},{"$f":"IF($C156,data!F132,0)","v":0}]
[null,{"$f":"data!B133","v":"Alicante"},{"$f":"CHOOSE(mySelectionType,\nSQRT((data!D133-control!$C$8)^2+(myAspectRatio*(data!E133-control!$C$9))^2)<=control!$C$17,\nAND(data!D133<=control!$C$8,data!E133>=control!$C$9,data!D133>=control!$C$10,data!E133<=control!$C$11))","v":false},{"$f":"IF($C157,data!D133,NA())","v":{"$error":"#N/A"}},{"$f":"IF($C157,data!E133,NA())","v":{"$error":"#N/A"}},{"$f":"IF($C157,data!F133,0)","v":0}]
[null,{"$f":"data!B134","v":"Bielefeld"},{"$f":"CHOOSE(mySelectionType,\nSQRT((data!D134-control!$C$8)^2+(myAspectRatio*(data!E134-control!$C$9))^2)<=control!$C$17,\nAND(data!D134<=control!$C$8,data!E134>=control!$C$9,data!D134>=control!$C$10,data!E134<=control!$C$11))","v":true},{"$f":"IF($C158,data!D134,NA())","v":52.033329999999999},{"$f":"IF($C158,data!E134,NA())","v":8.5333299999999994},{"$f":"IF($C158,data!F134,0)","v":331906}]
[null,{"$f":"data!B135","v":"Córdoba"},{"$f":"CHOOSE(mySelectionType,\nSQRT((data!D135-control!$C$8)^2+(myAspectRatio*(data!E135-control!$C$9))^2)<=control!$C$17,\nAND(data!D135<=control!$C$8,data!E135>=control!$C$9,data!D135>=control!$C$10,data!E135<=control!$C$11))","v":false},{"$f":"IF($C159,data!D135,NA())","v":{"$error":"#N/A"}},{"$f":"IF($C159,data!E135,NA())","v":{"$error":"#N/A"}},{"$f":"IF($C159,data!F135,0)","v":0}]
[null,{"$f":"data!B136","v":"Kherson"},{"$f":"CHOOSE(mySelectionType,\nSQRT((data!D136-control!$C$8)^2+(myAspectRatio*(data!E136-control!$C$9))^2)<=control!$C$17,\nAND(data!D136<=control!$C$8,data!E136>=control!$C$9,data!D136>=control!$C$10,data!E136<=control!$C$11))","v":true},{"$f":"IF($C160,data!D136,NA())","v":46.655810000000002},{"$f":"IF($C160,data!E136,NA())","v":32.617800000000003},{"$f":"IF($C160,data!F136,0)","v":320477}]
[null,{"$f":"data!B137","v":"Iaşi"},{"$f":"CHOOSE(mySelectionType,\nSQRT((data!D137-control!$C$8)^2+(myAspectRatio*(data!E137-control!$C$9))^2)<=control!$C$17,\nAND(data!D137<=control!$C$8,data!E137>=control!$C$9,data!D137>=control!$C$10,data!E137<=control!$C$11))","v":true},{"$f":"IF($C161,data!D137,NA())","v":47.166670000000003},{"$f":"IF($C161,data!E137,NA())","v":27.6},{"$f":"IF($C161,data!F137,0)","v":318012}]
[null,{"$f":"data!B138","v":"Valladolid"},{"$f":"CHOOSE(mySelectionType,\nSQRT((data!D138-control!$C$8)^2+(myAspectRatio*(data!E138-control!$C$9))^2)<=control!$C$17,\nAND(data!D138<=control!$C$8,data!E138>=control!$C$9,data!D138>=control!$C$10,data!E138<=control!$C$11))","v":false},{"$f":"IF($C162,data!D138,NA())","v":{"$error":"#N/A"}},{"$f":"IF($C162,data!E138,NA())","v":{"$error":"#N/A"}},{"$f":"IF($C162,data!F138,0)","v":0}]
[null,{"$f":"data!B139","v":"Poltava"},{"$f":"CHOOSE(mySelectionType,\nSQRT((data!D139-control!$C$8)^2+(myAspectRatio*(data!E139-control!$C$9))^2)<=control!$C$17,\nAND(data!D139<=control!$C$8,data!E139>=control!$C$9,data!D139>=control!$C$10,data!E139<=control!$C$11))","v":true},{"$f":"IF($C163,data!D139,NA())","v":49.593730000000001},{"$f":"IF($C163,data!E139,NA())","v":34.540730000000003},{"$f":"IF($C163,data!F139,0)","v":317847}]
[null,{"$f":"data!B140","v":"Hrodna"},{"$f":"CHOOSE(mySelectionType,\nSQRT((data!D140-control!$C$8)^2+(myAspectRatio*(data!E140-control!$C$9))^2)<=control!$C$17,\nAND(data!D140<=control!$C$8,data!E140>=control!$C$9,data!D140>=control!$C$10,data!E140<=control!$C$11))","v":true},{"$f":"IF($C164,data!D140,NA())","v":53.688400000000001},{"$f":"IF($C164,data!E140,NA())","v":23.825800000000001},{"$f":"IF($C164,data!F140,0)","v":317365}]
[null,{"$f":"data!B141","v":"Katowice"},{"$f":"CHOOSE(mySelectionType,\nSQRT((data!D141-control!$C$8)^2+(myAspectRatio*(data!E141-control!$C$9))^2)<=control!$C$17,\nAND(data!D141<=control!$C$8,data!E141>=control!$C$9,data!D141>=control!$C$10,data!E141<=control!$C$11))","v":true},{"$f":"IF($C165,data!D141,NA())","v":50.258409999999998},{"$f":"IF($C165,data!E141,NA())","v":19.027539999999998},{"$f":"IF($C165,data!F141,0)","v":317316}]
[null,{"$f":"data!B142","v":"Cluj-Napoca"},{"$f":"CHOOSE(mySelectionType,\nSQRT((data!D142-control!$C$8)^2+(myAspectRatio*(data!E142-control!$C$9))^2)<=control!$C$17,\nAND(data!D142<=control!$C$8,data!E142>=control!$C$9,data!D142>=control!$C$10,data!E142<=control!$C$11))","v":true},{"$f":"IF($C166,data!D142,NA())","v":46.766669999999998},{"$f":"IF($C166,data!E142,NA())","v":23.6},{"$f":"IF($C166,data!F142,0)","v":316748}]
[null,{"$f":"data!B143","v":"Timişoara"},{"$f":"CHOOSE(mySelectionType,\nSQRT((data!D143-control!$C$8)^2+(myAspectRatio*(data!E143-control!$C$9))^2)<=control!$C$17,\nAND(data!D143<=control!$C$8,data!E143>=control!$C$9,data!D143>=control!$C$10,data!E143<=control!$C$11))","v":true},{"$f":"IF($C167,data!D143,NA())","v":45.753720000000001},{"$f":"IF($C167,data!E143,NA())","v":21.225709999999999},{"$f":"IF($C167,data!F143,0)","v":315053}]
[null,{"$f":"data!B144","v":"Denizli"},{"$f":"CHOOSE(mySelectionType,\nSQRT((data!D144-control!$C$8)^2+(myAspectRatio*(data!E144-control!$C$9))^2)<=control!$C$17,\nAND(data!D144<=control!$C$8,data!E144>=control!$C$9,data!D144>=control!$C$10,data!E144<=control!$C$11))","v":false},{"$f":"IF($C168,data!D144,NA())","v":{"$error":"#N/A"}},{"$f":"IF($C168,data!E144,NA())","v":{"$error":"#N/A"}},{"$f":"IF($C168,data!F144,0)","v":0}]
[null,{"$f":"data!B145","v":"Bonn"},{"$f":"CHOOSE(mySelectionType,\nSQRT((data!D145-control!$C$8)^2+(myAspectRatio*(data!E145-control!$C$9))^2)<=control!$C$17,\nAND(data!D145<=control!$C$8,data!E145>=control!$C$9,data!D145>=control!$C$10,data!E145<=control!$C$11))","v":false},{"$f":"IF($C169,data!D145,NA())","v":{"$error":"#N/A"}},{"$f":"IF($C169,data!E145,NA())","v":{"$error":"#N/A"}},{"$f":"IF($C169,data!F145,0)","v":0}]
[null,{"$f":"data!B146","v":"Ostrava"},{"$f":"CHOOSE(mySelectionType,\nSQRT((data!D146-control!$C$8)^2+(myAspectRatio*(data!E146-control!$C$9))^2)<=control!$C$17,\nAND(data!D146<=control!$C$8,data!E146>=control!$C$9,data!D146>=control!$C$10,data!E146<=control!$C$11))","v":true},{"$f":"IF($C170,data!D146,NA())","v":49.834650000000003},{"$f":"IF($C170,data!E146,NA())","v":18.282039999999999},{"$f":"IF($C170,data!F146,0)","v":313088}]
[null,{"$f":"data!B147","v":"Varna"},{"$f":"CHOOSE(mySelectionType,\nSQRT((data!D147-control!$C$8)^2+(myAspectRatio*(data!E147-control!$C$9))^2)<=control!$C$17,\nAND(data!D147<=control!$C$8,data!E147>=control!$C$9,data!D147>=control!$C$10,data!E147<=control!$C$11))","v":true},{"$f":"IF($C171,data!D147,NA())","v":43.216670000000001},{"$f":"IF($C171,data!E147,NA())","v":27.91667},{"$f":"IF($C171,data!F147,0)","v":312770}]
[null,{"$f":"data!B148","v":"Coventry"},{"$f":"CHOOSE(mySelectionType,\nSQRT((data!D148-control!$C$8)^2+(myAspectRatio*(data!E148-control!$C$9))^2)<=control!$C$17,\nAND(data!D148<=control!$C$8,data!E148>=control!$C$9,data!D148>=control!$C$10,data!E148<=control!$C$11))","v":false},{"$f":"IF($C172,data!D148,NA())","v":{"$error":"#N/A"}},{"$f":"IF($C172,data!E148,NA())","v":{"$error":"#N/A"}},{"$f":"IF($C172,data!F148,0)","v":0}]
[null,{"$f":"data!B149","v":"Mannheim"},{"$f":"CHOOSE(mySelectionType,\nSQRT((data!D149-control!$C$8)^2+(myAspectRatio*(data!E149-control!$C$9))^2)<=control!$C$17,\nAND(data!D149<=control!$C$8,data!E149>=control!$C$9,data!D149>=control!$C$10,data!E149<=control!$C$11))","v":true},{"$f":"IF($C173,data!D149,NA())","v":49.49671},{"$f":"IF($C173,data!E149,NA())","v":8.4795499999999997},{"$f":"IF($C173,data!F149,0)","v":307960}]
[null,{"$f":"data!B150","v":"Chernihiv"},{"$f":"CHOOSE(mySelectionType,\nSQRT((data!D150-control!$C$8)^2+(myAspectRatio*(data!E150-control!$C$9))^2)<=control!$C$17,\nAND(data!D150<=control!$C$8,data!E150>=control!$C$9,data!D150>=control!$C$10,data!E150<=control!$C$11))","v":true},{"$f":"IF($C174,data!D150,NA())","v":51.505510000000001},{"$f":"IF($C174,data!E150,NA())","v":31.284870000000002},{"$f":"IF($C174,data!F150,0)","v":307684}]
[null,{"$f":"data!B151","v":"Craiova"},{"$f":"CHOOSE(mySelectionType,\nSQRT((data!D151-control!$C$8)^2+(myAspectRatio*(data!E151-control!$C$9))^2)<=control!$C$17,\nAND(data!D151<=control!$C$8,data!E151>=control!$C$9,data!D151>=control!$C$10,data!E151<=control!$C$11))","v":true},{"$f":"IF($C175,data!D151,NA())","v":44.316670000000002},{"$f":"IF($C175,data!E151,NA())","v":23.8},{"$f":"IF($C175,data!F151,0)","v":304142}]
[null,{"$f":"data!B152","v":"Constanţa"},{"$f":"CHOOSE(mySelectionType,\nSQRT((data!D152-control!$C$8)^2+(myAspectRatio*(data!E152-control!$C$9))^2)<=control!$C$17,\nAND(data!D152<=control!$C$8,data!E152>=control!$C$9,data!D152>=control!$C$10,data!E152<=control!$C$11))","v":true},{"$f":"IF($C176,data!D152,NA())","v":44.180729999999997},{"$f":"IF($C176,data!E152,NA())","v":28.634319999999999},{"$f":"IF($C176,data!F152,0)","v":303399}]
[null,{"$f":"data!B153","v":"Hull"},{"$f":"CHOOSE(mySelectionType,\nSQRT((data!D153-control!$C$8)^2+(myAspectRatio*(data!E153-control!$C$9))^2)<=control!$C$17,\nAND(data!D153<=control!$C$8,data!E153>=control!$C$9,data!D153>=control!$C$10,data!E153<=control!$C$11))","v":false},{"$f":"IF($C177,data!D153,NA())","v":{"$error":"#N/A"}},{"$f":"IF($C177,data!E153,NA())","v":{"$error":"#N/A"}},{"$f":"IF($C177,data!F153,0)","v":0}]
[null,{"$f":"data!B154","v":"Cardiff"},{"$f":"CHOOSE(mySelectionType,\nSQRT((data!D154-control!$C$8)^2+(myAspectRatio*(data!E154-control!$C$9))^2)<=control!$C$17,\nAND(data!D154<=control!$C$8,data!E154>=control!$C$9,data!D154>=control!$C$10,data!E154<=control!$C$11))","v":false},{"$f":"IF($C178,data!D154,NA())","v":{"$error":"#N/A"}},{"$f":"IF($C178,data!E154,NA())","v":{"$error":"#N/A"}},{"$f":"IF($C178,data!F154,0)","v":0}]
[null,{"$f":"data!B155","v":"Brest"},{"$f":"CHOOSE(mySelectionType,\nSQRT((data!D155-control!$C$8)^2+(myAspectRatio*(data!E155-control!$C$9))^2)<=control!$C$17,\nAND(data!D155<=control!$C$8,data!E155>=control!$C$9,data!D155>=control!$C$10,data!E155<=control!$C$11))","v":true},{"$f":"IF($C179,data!D155,NA())","v":52.097549999999998},{"$f":"IF($C179,data!E155,NA())","v":23.687750000000001},{"$f":"IF($C179,data!F155,0)","v":300715}]
[null,{"$f":"data!B156","v":"Bradford"},{"$f":"CHOOSE(mySelectionType,\nSQRT((data!D156-control!$C$8)^2+(myAspectRatio*(data!E156-control!$C$9))^2)<=control!$C$17,\nAND(data!D156<=control!$C$8,data!E156>=control!$C$9,data!D156>=control!$C$10,data!E156<=control!$C$11))","v":false},{"$f":"IF($C180,data!D156,NA())","v":{"$error":"#N/A"}},{"$f":"IF($C180,data!E156,NA())","v":{"$error":"#N/A"}},{"$f":"IF($C180,data!F156,0)","v":0}]
[null,{"$f":"data!B157","v":"Elazığ"},{"$f":"CHOOSE(mySelectionType,\nSQRT((data!D157-control!$C$8)^2+(myAspectRatio*(data!E157-control!$C$9))^2)<=control!$C$17,\nAND(data!D157<=control!$C$8,data!E157>=control!$C$9,data!D157>=control!$C$10,data!E157<=control!$C$11))","v":false},{"$f":"IF($C181,data!D157,NA())","v":{"$error":"#N/A"}},{"$f":"IF($C181,data!E157,NA())","v":{"$error":"#N/A"}},{"$f":"IF($C181,data!F157,0)","v":0}]
[null,{"$f":"data!B158","v":"Cherkasy"},{"$f":"CHOOSE(mySelectionType,\nSQRT((data!D158-control!$C$8)^2+(myAspectRatio*(data!E158-control!$C$9))^2)<=control!$C$17,\nAND(data!D158<=control!$C$8,data!E158>=control!$C$9,data!D158>=control!$C$10,data!E158<=control!$C$11))","v":true},{"$f":"IF($C182,data!D158,NA())","v":49.428539999999998},{"$f":"IF($C182,data!E158,NA())","v":32.062069999999999},{"$f":"IF($C182,data!F158,0)","v":297568}]
[null,{"$f":"data!B159","v":"Vigo"},{"$f":"CHOOSE(mySelectionType,\nSQRT((data!D159-control!$C$8)^2+(myAspectRatio*(data!E159-control!$C$9))^2)<=control!$C$17,\nAND(data!D159<=control!$C$8,data!E159>=control!$C$9,data!D159>=control!$C$10,data!E159<=control!$C$11))","v":false},{"$f":"IF($C183,data!D159,NA())","v":{"$error":"#N/A"}},{"$f":"IF($C183,data!E159,NA())","v":{"$error":"#N/A"}},{"$f":"IF($C183,data!F159,0)","v":0}]
[null,{"$f":"data!B160","v":"Sumy"},{"$f":"CHOOSE(mySelectionType,\nSQRT((data!D160-control!$C$8)^2+(myAspectRatio*(data!E160-control!$C$9))^2)<=control!$C$17,\nAND(data!D160<=control!$C$8,data!E160>=control!$C$9,data!D160>=control!$C$10,data!E160<=control!$C$11))","v":true},{"$f":"IF($C184,data!D160,NA())","v":50.921599999999998},{"$f":"IF($C184,data!E160,NA())","v":34.800289999999997},{"$f":"IF($C184,data!F160,0)","v":294456}]
[null,{"$f":"data!B161","v":"Galaţi"},{"$f":"CHOOSE(mySelectionType,\nSQRT((data!D161-control!$C$8)^2+(myAspectRatio*(data!E161-control!$C$9))^2)<=control!$C$17,\nAND(data!D161<=control!$C$8,data!E161>=control!$C$9,data!D161>=control!$C$10,data!E161<=control!$C$11))","v":true},{"$f":"IF($C185,data!D161,NA())","v":45.45},{"$f":"IF($C185,data!E161,NA())","v":28.05},{"$f":"IF($C185,data!F161,0)","v":294087}]
[null,{"$f":"data!B162","v":"Białystok"},{"$f":"CHOOSE(mySelectionType,\nSQRT((data!D162-control!$C$8)^2+(myAspectRatio*(data!E162-control!$C$9))^2)<=control!$C$17,\nAND(data!D162<=control!$C$8,data!E162>=control!$C$9,data!D162>=control!$C$10,data!E162<=control!$C$11))","v":true},{"$f":"IF($C186,data!D162,NA())","v":53.133330000000001},{"$f":"IF($C186,data!E162,NA())","v":23.16433},{"$f":"IF($C186,data!F162,0)","v":291855}]
[null,{"$f":"data!B163","v":"Catania"},{"$f":"CHOOSE(mySelectionType,\nSQRT((data!D163-control!$C$8)^2+(myAspectRatio*(data!E163-control!$C$9))^2)<=control!$C$17,\nAND(data!D163<=control!$C$8,data!E163>=control!$C$9,data!D163>=control!$C$10,data!E163<=control!$C$11))","v":false},{"$f":"IF($C187,data!D163,NA())","v":{"$error":"#N/A"}},{"$f":"IF($C187,data!E163,NA())","v":{"$error":"#N/A"}},{"$f":"IF($C187,data!F163,0)","v":0}]
[null,{"$f":"data!B164","v":"Utrecht"},{"$f":"CHOOSE(mySelectionType,\nSQRT((data!D164-control!$C$8)^2+(myAspectRatio*(data!E164-control!$C$9))^2)<=control!$C$17,\nAND(data!D164<=control!$C$8,data!E164>=control!$C$9,data!D164>=control!$C$10,data!E164<=control!$C$11))","v":false},{"$f":"IF($C188,data!D164,NA())","v":{"$error":"#N/A"}},{"$f":"IF($C188,data!E164,NA())","v":{"$error":"#N/A"}},{"$f":"IF($C188,data!F164,0)","v":0}]
[null,{"$f":"data!B165","v":"Adapazarı"},{"$f":"CHOOSE(mySelectionType,\nSQRT((data!D165-control!$C$8)^2+(myAspectRatio*(data!E165-control!$C$9))^2)<=control!$C$17,\nAND(data!D165<=control!$C$8,data!E165>=control!$C$9,data!D165>=control!$C$10,data!E165<=control!$C$11))","v":true},{"$f":"IF($C189,data!D165,NA())","v":40.780560000000001},{"$f":"IF($C189,data!E165,NA())","v":30.40333},{"$f":"IF($C189,data!F165,0)","v":286787}]
[null,{"$f":"data!B166","v":"Karlsruhe"},{"$f":"CHOOSE(mySelectionType,\nSQRT((data!D166-control!$C$8)^2+(myAspectRatio*(data!E166-control!$C$9))^2)<=control!$C$17,\nAND(data!D166<=control!$C$8,data!E166>=control!$C$9,data!D166>=control!$C$10,data!E166<=control!$C$11))","v":true},{"$f":"IF($C190,data!D166,NA())","v":49.009369999999997},{"$f":"IF($C190,data!E166,NA())","v":8.4044399999999992},{"$f":"IF($C190,data!F166,0)","v":283799}]
[null,{"$f":"data!B167","v":"Zhytomyr"},{"$f":"CHOOSE(mySelectionType,\nSQRT((data!D167-control!$C$8)^2+(myAspectRatio*(data!E167-control!$C$9))^2)<=control!$C$17,\nAND(data!D167<=control!$C$8,data!E167>=control!$C$9,data!D167>=control!$C$10,data!E167<=control!$C$11))","v":true},{"$f":"IF($C191,data!D167,NA())","v":50.264870000000002},{"$f":"IF($C191,data!E167,NA())","v":28.676690000000001},{"$f":"IF($C191,data!F167,0)","v":282192}]
[null,{"$f":"data!B168","v":"Gebze"},{"$f":"CHOOSE(mySelectionType,\nSQRT((data!D168-control!$C$8)^2+(myAspectRatio*(data!E168-control!$C$9))^2)<=control!$C$17,\nAND(data!D168<=control!$C$8,data!E168>=control!$C$9,data!D168>=control!$C$10,data!E168<=control!$C$11))","v":true},{"$f":"IF($C192,data!D168,NA())","v":40.802759999999999},{"$f":"IF($C192,data!E168,NA())","v":29.430679999999999},{"$f":"IF($C192,data!F168,0)","v":281436}]
[null,{"$f":"data!B169","v":"Horlivka"},{"$f":"CHOOSE(mySelectionType,\nSQRT((data!D169-control!$C$8)^2+(myAspectRatio*(data!E169-control!$C$9))^2)<=control!$C$17,\nAND(data!D169<=control!$C$8,data!E169>=control!$C$9,data!D169>=control!$C$10,data!E169<=control!$C$11))","v":false},{"$f":"IF($C193,data!D169,NA())","v":{"$error":"#N/A"}},{"$f":"IF($C193,data!E169,NA())","v":{"$error":"#N/A"}},{"$f":"IF($C193,data!F169,0)","v":0}]
[null,{"$f":"data!B170","v":"Gijón"},{"$f":"CHOOSE(mySelectionType,\nSQRT((data!D170-control!$C$8)^2+(myAspectRatio*(data!E170-control!$C$9))^2)<=control!$C$17,\nAND(data!D170<=control!$C$8,data!E170>=control!$C$9,data!D170>=control!$C$10,data!E170<=control!$C$11))","v":false},{"$f":"IF($C194,data!D170,NA())","v":{"$error":"#N/A"}},{"$f":"IF($C194,data!E170,NA())","v":{"$error":"#N/A"}},{"$f":"IF($C194,data!F170,0)","v":0}]
[null,{"$f":"data!B171","v":"Bari"},{"$f":"CHOOSE(mySelectionType,\nSQRT((data!D171-control!$C$8)^2+(myAspectRatio*(data!E171-control!$C$9))^2)<=control!$C$17,\nAND(data!D171<=control!$C$8,data!E171>=control!$C$9,data!D171>=control!$C$10,data!E171<=control!$C$11))","v":true},{"$f":"IF($C195,data!D171,NA())","v":41.11148},{"$f":"IF($C195,data!E171,NA())","v":16.855399999999999},{"$f":"IF($C195,data!F171,0)","v":277387}]
[null,{"$f":"data!B172","v":"Nantes"},{"$f":"CHOOSE(mySelectionType,\nSQRT((data!D172-control!$C$8)^2+(myAspectRatio*(data!E172-control!$C$9))^2)<=control!$C$17,\nAND(data!D172<=control!$C$8,data!E172>=control!$C$9,data!D172>=control!$C$10,data!E172<=control!$C$11))","v":false},{"$f":"IF($C196,data!D172,NA())","v":{"$error":"#N/A"}},{"$f":"IF($C196,data!E172,NA())","v":{"$error":"#N/A"}},{"$f":"IF($C196,data!F172,0)","v":0}]
[null,{"$f":"data!B173","v":"Braşov"},{"$f":"CHOOSE(mySelectionType,\nSQRT((data!D173-control!$C$8)^2+(myAspectRatio*(data!E173-control!$C$9))^2)<=control!$C$17,\nAND(data!D173<=control!$C$8,data!E173>=control!$C$9,data!D173>=control!$C$10,data!E173<=control!$C$11))","v":true},{"$f":"IF($C197,data!D173,NA())","v":45.648609999999998},{"$f":"IF($C197,data!E173,NA())","v":25.60613},{"$f":"IF($C197,data!F173,0)","v":276088}]
[null,{"$f":"data!B174","v":"Strasbourg"},{"$f":"CHOOSE(mySelectionType,\nSQRT((data!D174-control!$C$8)^2+(myAspectRatio*(data!E174-control!$C$9))^2)<=control!$C$17,\nAND(data!D174<=control!$C$8,data!E174>=control!$C$9,data!D174>=control!$C$10,data!E174<=control!$C$11))","v":true},{"$f":"IF($C198,data!D174,NA())","v":48.583919999999999},{"$f":"IF($C198,data!E174,NA())","v":7.7455299999999996},{"$f":"IF($C198,data!F174,0)","v":274845}]
[null,{"$f":"data!B175","v":"Belfast"},{"$f":"CHOOSE(mySelectionType,\nSQRT((data!D175-control!$C$8)^2+(myAspectRatio*(data!E175-control!$C$9))^2)<=control!$C$17,\nAND(data!D175<=control!$C$8,data!E175>=control!$C$9,data!D175>=control!$C$10,data!E175<=control!$C$11))","v":false},{"$f":"IF($C199,data!D175,NA())","v":{"$error":"#N/A"}},{"$f":"IF($C199,data!E175,NA())","v":{"$error":"#N/A"}},{"$f":"IF($C199,data!F175,0)","v":0}]
[null,{"$f":"data!B176","v":"Wiesbaden"},{"$f":"CHOOSE(mySelectionType,\nSQRT((data!D176-control!$C$8)^2+(myAspectRatio*(data!E176-control!$C$9))^2)<=control!$C$17,\nAND(data!D176<=control!$C$8,data!E176>=control!$C$9,data!D176>=control!$C$10,data!E176<=control!$C$11))","v":true},{"$f":"IF($C200,data!D176,NA())","v":50.08258},{"$f":"IF($C200,data!E176,NA())","v":8.2493200000000009},{"$f":"IF($C200,data!F176,0)","v":272432}]
[null,{"$f":"data!B177","v":"Ljubljana"},{"$f":"CHOOSE(mySelectionType,\nSQRT((data!D177-control!$C$8)^2+(myAspectRatio*(data!E177-control!$C$9))^2)<=control!$C$17,\nAND(data!D177<=control!$C$8,data!E177>=control!$C$9,data!D177>=control!$C$10,data!E177<=control!$C$11))","v":true},{"$f":"IF($C201,data!D177,NA())","v":46.051079999999999},{"$f":"IF($C201,data!E177,NA())","v":14.505129999999999},{"$f":"IF($C201,data!F177,0)","v":272220}]
[null,{"$f":"data!B178","v":"Münster"},{"$f":"CHOOSE(mySelectionType,\nSQRT((data!D178-control!$C$8)^2+(myAspectRatio*(data!E178-control!$C$9))^2)<=control!$C$17,\nAND(data!D178<=control!$C$8,data!E178>=control!$C$9,data!D178>=control!$C$10,data!E178<=control!$C$11))","v":false},{"$f":"IF($C202,data!D178,NA())","v":{"$error":"#N/A"}},{"$f":"IF($C202,data!E178,NA())","v":{"$error":"#N/A"}},{"$f":"IF($C202,data!F178,0)","v":0}]
[null,{"$f":"data!B179","v":"Gelsenkirchen"},{"$f":"CHOOSE(mySelectionType,\nSQRT((data!D179-control!$C$8)^2+(myAspectRatio*(data!E179-control!$C$9))^2)<=control!$C$17,\nAND(data!D179<=control!$C$8,data!E179>=control!$C$9,data!D179>=control!$C$10,data!E179<=control!$C$11))","v":false},{"$f":"IF($C203,data!D179,NA())","v":{"$error":"#N/A"}},{"$f":"IF($C203,data!E179,NA())","v":{"$error":"#N/A"}},{"$f":"IF($C203,data!F179,0)","v":0}]
[null,{"$f":"data!B180","v":"Aachen"},{"$f":"CHOOSE(mySelectionType,\nSQRT((data!D180-control!$C$8)^2+(myAspectRatio*(data!E180-control!$C$9))^2)<=control!$C$17,\nAND(data!D180<=control!$C$8,data!E180>=control!$C$9,data!D180>=control!$C$10,data!E180<=control!$C$11))","v":false},{"$f":"IF($C204,data!D180,NA())","v":{"$error":"#N/A"}},{"$f":"IF($C204,data!E180,NA())","v":{"$error":"#N/A"}},{"$f":"IF($C204,data!F180,0)","v":0}]
[null,{"$f":"data!B181","v":"Sivas"},{"$f":"CHOOSE(mySelectionType,\nSQRT((data!D181-control!$C$8)^2+(myAspectRatio*(data!E181-control!$C$9))^2)<=control!$C$17,\nAND(data!D181<=control!$C$8,data!E181>=control!$C$9,data!D181>=control!$C$10,data!E181<=control!$C$11))","v":false},{"$f":"IF($C205,data!D181,NA())","v":{"$error":"#N/A"}},{"$f":"IF($C205,data!E181,NA())","v":{"$error":"#N/A"}},{"$f":"IF($C205,data!F181,0)","v":0}]
[null,{"$f":"data!B182","v":"Mönchengladbach"},{"$f":"CHOOSE(mySelectionType,\nSQRT((data!D182-control!$C$8)^2+(myAspectRatio*(data!E182-control!$C$9))^2)<=control!$C$17,\nAND(data!D182<=control!$C$8,data!E182>=control!$C$9,data!D182>=control!$C$10,data!E182<=control!$C$11))","v":false},{"$f":"IF($C206,data!D182,NA())","v":{"$error":"#N/A"}},{"$f":"IF($C206,data!E182,NA())","v":{"$error":"#N/A"}},{"$f":"IF($C206,data!F182,0)","v":0}]
[null,{"$f":"data!B183","v":"Malmö"},{"$f":"CHOOSE(mySelectionType,\nSQRT((data!D183-control!$C$8)^2+(myAspectRatio*(data!E183-control!$C$9))^2)<=control!$C$17,\nAND(data!D183<=control!$C$8,data!E183>=control!$C$9,data!D183>=control!$C$10,data!E183<=control!$C$11))","v":true},{"$f":"IF($C207,data!D183,NA())","v":55.605870000000003},{"$f":"IF($C207,data!E183,NA())","v":13.000730000000001},{"$f":"IF($C207,data!F183,0)","v":261548}]
[null,{"$f":"data!B184","v":"Stoke-on-Trent"},{"$f":"CHOOSE(mySelectionType,\nSQRT((data!D184-control!$C$8)^2+(myAspectRatio*(data!E184-control!$C$9))^2)<=control!$C$17,\nAND(data!D184<=control!$C$8,data!E184>=control!$C$9,data!D184>=control!$C$10,data!E184<=control!$C$11))","v":false},{"$f":"IF($C208,data!D184,NA())","v":{"$error":"#N/A"}},{"$f":"IF($C208,data!E184,NA())","v":{"$error":"#N/A"}},{"$f":"IF($C208,data!F184,0)","v":0}]
[null,{"$f":"data!B185","v":"Augsburg"},{"$f":"CHOOSE(mySelectionType,\nSQRT((data!D185-control!$C$8)^2+(myAspectRatio*(data!E185-control!$C$9))^2)<=control!$C$17,\nAND(data!D185<=control!$C$8,data!E185>=control!$C$9,data!D185>=control!$C$10,data!E185<=control!$C$11))","v":true},{"$f":"IF($C209,data!D185,NA())","v":48.371540000000003},{"$f":"IF($C209,data!E185,NA())","v":10.89851},{"$f":"IF($C209,data!F185,0)","v":259196}]
[null,{"$f":"data!B186","v":"Espoo"},{"$f":"CHOOSE(mySelectionType,\nSQRT((data!D186-control!$C$8)^2+(myAspectRatio*(data!E186-control!$C$9))^2)<=control!$C$17,\nAND(data!D186<=control!$C$8,data!E186>=control!$C$9,data!D186>=control!$C$10,data!E186<=control!$C$11))","v":true},{"$f":"IF($C210,data!D186,NA())","v":60.205199999999998},{"$f":"IF($C210,data!E186,NA())","v":24.652200000000001},{"$f":"IF($C210,data!F186,0)","v":256760}]
[null,{"$f":"data!B187","v":"Tarsus"},{"$f":"CHOOSE(mySelectionType,\nSQRT((data!D187-control!$C$8)^2+(myAspectRatio*(data!E187-control!$C$9))^2)<=control!$C$17,\nAND(data!D187<=control!$C$8,data!E187>=control!$C$9,data!D187>=control!$C$10,data!E187<=control!$C$11))","v":false},{"$f":"IF($C211,data!D187,NA())","v":{"$error":"#N/A"}},{"$f":"IF($C211,data!E187,NA())","v":{"$error":"#N/A"}},{"$f":"IF($C211,data!F187,0)","v":0}]
[null,{"$f":"data!B188","v":"Rivne"},{"$f":"CHOOSE(mySelectionType,\nSQRT((data!D188-control!$C$8)^2+(myAspectRatio*(data!E188-control!$C$9))^2)<=control!$C$17,\nAND(data!D188<=control!$C$8,data!E188>=control!$C$9,data!D188>=control!$C$10,data!E188<=control!$C$11))","v":true},{"$f":"IF($C212,data!D188,NA())","v":50.623080000000002},{"$f":"IF($C212,data!E188,NA())","v":26.227429999999998},{"$f":"IF($C212,data!F188,0)","v":255106}]
[null,{"$f":"data!B189","v":"Gdynia"},{"$f":"CHOOSE(mySelectionType,\nSQRT((data!D189-control!$C$8)^2+(myAspectRatio*(data!E189-control!$C$9))^2)<=control!$C$17,\nAND(data!D189<=control!$C$8,data!E189>=control!$C$9,data!D189>=control!$C$10,data!E189<=control!$C$11))","v":true},{"$f":"IF($C213,data!D189,NA())","v":54.518889999999999},{"$f":"IF($C213,data!E189,NA())","v":18.531880000000001},{"$f":"IF($C213,data!F189,0)","v":253730}]
[null,{"$f":"data!B190","v":"Wolverhampton"},{"$f":"CHOOSE(mySelectionType,\nSQRT((data!D190-control!$C$8)^2+(myAspectRatio*(data!E190-control!$C$9))^2)<=control!$C$17,\nAND(data!D190<=control!$C$8,data!E190>=control!$C$9,data!D190>=control!$C$10,data!E190<=control!$C$11))","v":false},{"$f":"IF($C214,data!D190,NA())","v":{"$error":"#N/A"}},{"$f":"IF($C214,data!E190,NA())","v":{"$error":"#N/A"}},{"$f":"IF($C214,data!F190,0)","v":0}]
[null,{"$f":"data!B191","v":"Niš"},{"$f":"CHOOSE(mySelectionType,\nSQRT((data!D191-control!$C$8)^2+(myAspectRatio*(data!E191-control!$C$9))^2)<=control!$C$17,\nAND(data!D191<=control!$C$8,data!E191>=control!$C$9,data!D191>=control!$C$10,data!E191<=control!$C$11))","v":true},{"$f":"IF($C215,data!D191,NA())","v":43.324719999999999},{"$f":"IF($C215,data!E191,NA())","v":21.90333},{"$f":"IF($C215,data!F191,0)","v":250000}]
[null,{"$f":"data!B192","v":"Porto"},{"$f":"CHOOSE(mySelectionType,\nSQRT((data!D192-control!$C$8)^2+(myAspectRatio*(data!E192-control!$C$9))^2)<=control!$C$17,\nAND(data!D192<=control!$C$8,data!E192>=control!$C$9,data!D192>=control!$C$10,data!E192<=control!$C$11))","v":false},{"$f":"IF($C216,data!D192,NA())","v":{"$error":"#N/A"}},{"$f":"IF($C216,data!E192,NA())","v":{"$error":"#N/A"}},{"$f":"IF($C216,data!F192,0)","v":0}]
[null,{"$f":"data!B193","v":"Kirovohrad"},{"$f":"CHOOSE(mySelectionType,\nSQRT((data!D193-control!$C$8)^2+(myAspectRatio*(data!E193-control!$C$9))^2)<=control!$C$17,\nAND(data!D193<=control!$C$8,data!E193>=control!$C$9,data!D193>=control!$C$10,data!E193<=control!$C$11))","v":true},{"$f":"IF($C217,data!D193,NA())","v":48.513199999999998},{"$f":"IF($C217,data!E193,NA())","v":32.259700000000002},{"$f":"IF($C217,data!F193,0)","v":249454}]
[null,{"$f":"data!B194","v":"Dniprodzerzhyns’k"},{"$f":"CHOOSE(mySelectionType,\nSQRT((data!D194-control!$C$8)^2+(myAspectRatio*(data!E194-control!$C$9))^2)<=control!$C$17,\nAND(data!D194<=control!$C$8,data!E194>=control!$C$9,data!D194>=control!$C$10,data!E194<=control!$C$11))","v":true},{"$f":"IF($C218,data!D194,NA())","v":48.511339999999997},{"$f":"IF($C218,data!E194,NA())","v":34.6021},{"$f":"IF($C218,data!F194,0)","v":248575}]
[null,{"$f":"data!B195","v":"Montpellier"},{"$f":"CHOOSE(mySelectionType,\nSQRT((data!D195-control!$C$8)^2+(myAspectRatio*(data!E195-control!$C$9))^2)<=control!$C$17,\nAND(data!D195<=control!$C$8,data!E195>=control!$C$9,data!D195>=control!$C$10,data!E195<=control!$C$11))","v":false},{"$f":"IF($C219,data!D195,NA())","v":{"$error":"#N/A"}},{"$f":"IF($C219,data!E195,NA())","v":{"$error":"#N/A"}},{"$f":"IF($C219,data!F195,0)","v":0}]
[null,{"$f":"data!B196","v":"Częstochowa"},{"$f":"CHOOSE(mySelectionType,\nSQRT((data!D196-control!$C$8)^2+(myAspectRatio*(data!E196-control!$C$9))^2)<=control!$C$17,\nAND(data!D196<=control!$C$8,data!E196>=control!$C$9,data!D196>=control!$C$10,data!E196<=control!$C$11))","v":true},{"$f":"IF($C220,data!D196,NA())","v":50.796460000000003},{"$f":"IF($C220,data!E196,NA())","v":19.124089999999999},{"$f":"IF($C220,data!F196,0)","v":248125}]
[null,{"$f":"data!B197","v":"Plymouth"},{"$f":"CHOOSE(mySelectionType,\nSQRT((data!D197-control!$C$8)^2+(myAspectRatio*(data!E197-control!$C$9))^2)<=control!$C$17,\nAND(data!D197<=control!$C$8,data!E197>=control!$C$9,data!D197>=control!$C$10,data!E197<=control!$C$11))","v":false},{"$f":"IF($C221,data!D197,NA())","v":{"$error":"#N/A"}},{"$f":"IF($C221,data!E197,NA())","v":{"$error":"#N/A"}},{"$f":"IF($C221,data!F197,0)","v":0}]
[null,{"$f":"data!B198","v":"Chemnitz"},{"$f":"CHOOSE(mySelectionType,\nSQRT((data!D198-control!$C$8)^2+(myAspectRatio*(data!E198-control!$C$9))^2)<=control!$C$17,\nAND(data!D198<=control!$C$8,data!E198>=control!$C$9,data!D198>=control!$C$10,data!E198<=control!$C$11))","v":true},{"$f":"IF($C222,data!D198,NA())","v":50.835700000000003},{"$f":"IF($C222,data!E198,NA())","v":12.929220000000001},{"$f":"IF($C222,data!F198,0)","v":247220}]
[null,{"$f":"data!B199","v":"Nottingham"},{"$f":"CHOOSE(mySelectionType,\nSQRT((data!D199-control!$C$8)^2+(myAspectRatio*(data!E199-control!$C$9))^2)<=control!$C$17,\nAND(data!D199<=control!$C$8,data!E199>=control!$C$9,data!D199>=control!$C$10,data!E199<=control!$C$11))","v":false},{"$f":"IF($C223,data!D199,NA())","v":{"$error":"#N/A"}},{"$f":"IF($C223,data!E199,NA())","v":{"$error":"#N/A"}},{"$f":"IF($C223,data!F199,0)","v":0}]
[null,{"$f":"data!B200","v":"Southampton"},{"$f":"CHOOSE(mySelectionType,\nSQRT((data!D200-control!$C$8)^2+(myAspectRatio*(data!E200-control!$C$9))^2)<=control!$C$17,\nAND(data!D200<=control!$C$8,data!E200>=control!$C$9,data!D200>=control!$C$10,data!E200<=control!$C$11))","v":false},{"$f":"IF($C224,data!D200,NA())","v":{"$error":"#N/A"}},{"$f":"IF($C224,data!E200,NA())","v":{"$error":"#N/A"}},{"$f":"IF($C224,data!F200,0)","v":0}]
[null,{"$f":"data!B201","v":"A Coruña"},{"$f":"CHOOSE(mySelectionType,\nSQRT((data!D201-control!$C$8)^2+(myAspectRatio*(data!E201-control!$C$9))^2)<=control!$C$17,\nAND(data!D201<=control!$C$8,data!E201>=control!$C$9,data!D201>=control!$C$10,data!E201<=control!$C$11))","v":false},{"$f":"IF($C225,data!D201,NA())","v":{"$error":"#N/A"}},{"$f":"IF($C225,data!E201,NA())","v":{"$error":"#N/A"}},{"$f":"IF($C225,data!F201,0)","v":0}]
[null,{"$f":"data!B202","v":"Braunschweig"},{"$f":"CHOOSE(mySelectionType,\nSQRT((data!D202-control!$C$8)^2+(myAspectRatio*(data!E202-control!$C$9))^2)<=control!$C$17,\nAND(data!D202<=control!$C$8,data!E202>=control!$C$9,data!D202>=control!$C$10,data!E202<=control!$C$11))","v":true},{"$f":"IF($C226,data!D202,NA())","v":52.265940000000001},{"$f":"IF($C226,data!E202,NA())","v":10.526730000000001},{"$f":"IF($C226,data!F202,0)","v":244715}]
[null,{"$f":"data!B203","v":"Trabzon"},{"$f":"CHOOSE(mySelectionType,\nSQRT((data!D203-control!$C$8)^2+(myAspectRatio*(data!E203-control!$C$9))^2)<=control!$C$17,\nAND(data!D203<=control!$C$8,data!E203>=control!$C$9,data!D203>=control!$C$10,data!E203<=control!$C$11))","v":false},{"$f":"IF($C227,data!D203,NA())","v":{"$error":"#N/A"}},{"$f":"IF($C227,data!E203,NA())","v":{"$error":"#N/A"}},{"$f":"IF($C227,data!F203,0)","v":0}]
[null,{"$f":"data!B204","v":"Reading"},{"$f":"CHOOSE(mySelectionType,\nSQRT((data!D204-control!$C$8)^2+(myAspectRatio*(data!E204-control!$C$9))^2)<=control!$C$17,\nAND(data!D204<=control!$C$8,data!E204>=control!$C$9,data!D204>=control!$C$10,data!E204<=control!$C$11))","v":false},{"$f":"IF($C228,data!D204,NA())","v":{"$error":"#N/A"}},{"$f":"IF($C228,data!E204,NA())","v":{"$error":"#N/A"}},{"$f":"IF($C228,data!F204,0)","v":0}]
[null,{"$f":"data!B205","v":"Manisa"},{"$f":"CHOOSE(mySelectionType,\nSQRT((data!D205-control!$C$8)^2+(myAspectRatio*(data!E205-control!$C$9))^2)<=control!$C$17,\nAND(data!D205<=control!$C$8,data!E205>=control!$C$9,data!D205>=control!$C$10,data!E205<=control!$C$11))","v":true},{"$f":"IF($C229,data!D205,NA())","v":38.612020000000001},{"$f":"IF($C229,data!E205,NA())","v":27.426469999999998},{"$f":"IF($C229,data!F205,0)","v":243971}]
[null,{"$f":"data!B206","v":"Halle Neustadt"},{"$f":"CHOOSE(mySelectionType,\nSQRT((data!D206-control!$C$8)^2+(myAspectRatio*(data!E206-control!$C$9))^2)<=control!$C$17,\nAND(data!D206<=control!$C$8,data!E206>=control!$C$9,data!D206>=control!$C$10,data!E206<=control!$C$11))","v":true},{"$f":"IF($C230,data!D206,NA())","v":51.479239999999997},{"$f":"IF($C230,data!E206,NA())","v":11.91605},{"$f":"IF($C230,data!F206,0)","v":240000}]
[null,{"$f":"data!B207","v":"Balıkesir"},{"$f":"CHOOSE(mySelectionType,\nSQRT((data!D207-control!$C$8)^2+(myAspectRatio*(data!E207-control!$C$9))^2)<=control!$C$17,\nAND(data!D207<=control!$C$8,data!E207>=control!$C$9,data!D207>=control!$C$10,data!E207<=control!$C$11))","v":true},{"$f":"IF($C231,data!D207,NA())","v":39.649169999999998},{"$f":"IF($C231,data!E207,NA())","v":27.886109999999999},{"$f":"IF($C231,data!F207,0)","v":238151}]
[null,{"$f":"data!B208","v":"Krefeld"},{"$f":"CHOOSE(mySelectionType,\nSQRT((data!D208-control!$C$8)^2+(myAspectRatio*(data!E208-control!$C$9))^2)<=control!$C$17,\nAND(data!D208<=control!$C$8,data!E208>=control!$C$9,data!D208>=control!$C$10,data!E208<=control!$C$11))","v":false},{"$f":"IF($C232,data!D208,NA())","v":{"$error":"#N/A"}},{"$f":"IF($C232,data!E208,NA())","v":{"$error":"#N/A"}},{"$f":"IF($C232,data!F208,0)","v":0}]
[null,{"$f":"data!B209","v":"Århus"},{"$f":"CHOOSE(mySelectionType,\nSQRT((data!D209-control!$C$8)^2+(myAspectRatio*(data!E209-control!$C$9))^2)<=control!$C$17,\nAND(data!D209<=control!$C$8,data!E209>=control!$C$9,data!D209>=control!$C$10,data!E209<=control!$C$11))","v":false},{"$f":"IF($C233,data!D209,NA())","v":{"$error":"#N/A"}},{"$f":"IF($C233,data!E209,NA())","v":{"$error":"#N/A"}},{"$f":"IF($C233,data!F209,0)","v":0}]
[null,{"$f":"data!B210","v":"Košice"},{"$f":"CHOOSE(mySelectionType,\nSQRT((data!D210-control!$C$8)^2+(myAspectRatio*(data!E210-control!$C$9))^2)<=control!$C$17,\nAND(data!D210<=control!$C$8,data!E210>=control!$C$9,data!D210>=control!$C$10,data!E210<=control!$C$11))","v":true},{"$f":"IF($C234,data!D210,NA())","v":48.713949999999997},{"$f":"IF($C234,data!E210,NA())","v":21.25808},{"$f":"IF($C234,data!F210,0)","v":236563}]
[null,{"$f":"data!B211","v":"Chernivtsi"},{"$f":"CHOOSE(mySelectionType,\nSQRT((data!D211-control!$C$8)^2+(myAspectRatio*(data!E211-control!$C$9))^2)<=control!$C$17,\nAND(data!D211<=control!$C$8,data!E211>=control!$C$9,data!D211>=control!$C$10,data!E211<=control!$C$11))","v":true},{"$f":"IF($C235,data!D211,NA())","v":48.291490000000003},{"$f":"IF($C235,data!E211,NA())","v":25.940339999999999},{"$f":"IF($C235,data!F211,0)","v":236250}]
[null,{"$f":"data!B212","v":"Ternopil’"},{"$f":"CHOOSE(mySelectionType,\nSQRT((data!D212-control!$C$8)^2+(myAspectRatio*(data!E212-control!$C$9))^2)<=control!$C$17,\nAND(data!D212<=control!$C$8,data!E212>=control!$C$9,data!D212>=control!$C$10,data!E212<=control!$C$11))","v":true},{"$f":"IF($C236,data!D212,NA())","v":49.555889999999998},{"$f":"IF($C236,data!E212,NA())","v":25.605560000000001},{"$f":"IF($C236,data!F212,0)","v":235676}]
[null,{"$f":"data!B213","v":"Gasteiz / Vitoria"},{"$f":"CHOOSE(mySelectionType,\nSQRT((data!D213-control!$C$8)^2+(myAspectRatio*(data!E213-control!$C$9))^2)<=control!$C$17,\nAND(data!D213<=control!$C$8,data!E213>=control!$C$9,data!D213>=control!$C$10,data!E213<=control!$C$11))","v":false},{"$f":"IF($C237,data!D213,NA())","v":{"$error":"#N/A"}},{"$f":"IF($C237,data!E213,NA())","v":{"$error":"#N/A"}},{"$f":"IF($C237,data!F213,0)","v":0}]
[null,{"$f":"data!B214","v":"Derby"},{"$f":"CHOOSE(mySelectionType,\nSQRT((data!D214-control!$C$8)^2+(myAspectRatio*(data!E214-control!$C$9))^2)<=control!$C$17,\nAND(data!D214<=control!$C$8,data!E214>=control!$C$9,data!D214>=control!$C$10,data!E214<=control!$C$11))","v":false},{"$f":"IF($C238,data!D214,NA())","v":{"$error":"#N/A"}},{"$f":"IF($C238,data!E214,NA())","v":{"$error":"#N/A"}},{"$f":"IF($C238,data!F214,0)","v":0}]
[null,{"$f":"data!B215","v":"Granada"},{"$f":"CHOOSE(mySelectionType,\nSQRT((data!D215-control!$C$8)^2+(myAspectRatio*(data!E215-control!$C$9))^2)<=control!$C$17,\nAND(data!D215<=control!$C$8,data!E215>=control!$C$9,data!D215>=control!$C$10,data!E215<=control!$C$11))","v":false},{"$f":"IF($C239,data!D215,NA())","v":{"$error":"#N/A"}},{"$f":"IF($C239,data!E215,NA())","v":{"$error":"#N/A"}},{"$f":"IF($C239,data!F215,0)","v":0}]
[null,{"$f":"data!B216","v":"Halle (Saale)"},{"$f":"CHOOSE(mySelectionType,\nSQRT((data!D216-control!$C$8)^2+(myAspectRatio*(data!E216-control!$C$9))^2)<=control!$C$17,\nAND(data!D216<=control!$C$8,data!E216>=control!$C$9,data!D216>=control!$C$10,data!E216<=control!$C$11))","v":true},{"$f":"IF($C240,data!D216,NA())","v":51.5},{"$f":"IF($C240,data!E216,NA())","v":12},{"$f":"IF($C240,data!F216,0)","v":234107}]
[null,{"$f":"data!B217","v":"Kiel"},{"$f":"CHOOSE(mySelectionType,\nSQRT((data!D217-control!$C$8)^2+(myAspectRatio*(data!E217-control!$C$9))^2)<=control!$C$17,\nAND(data!D217<=control!$C$8,data!E217>=control!$C$9,data!D217>=control!$C$10,data!E217<=control!$C$11))","v":true},{"$f":"IF($C241,data!D217,NA())","v":54.321330000000003},{"$f":"IF($C241,data!E217,NA())","v":10.13489},{"$f":"IF($C241,data!F217,0)","v":232758}]
[null,{"$f":"data!B218","v":"Bordeaux"},{"$f":"CHOOSE(mySelectionType,\nSQRT((data!D218-control!$C$8)^2+(myAspectRatio*(data!E218-control!$C$9))^2)<=control!$C$17,\nAND(data!D218<=control!$C$8,data!E218>=control!$C$9,data!D218>=control!$C$10,data!E218<=control!$C$11))","v":false},{"$f":"IF($C242,data!D218,NA())","v":{"$error":"#N/A"}},{"$f":"IF($C242,data!E218,NA())","v":{"$error":"#N/A"}},{"$f":"IF($C242,data!F218,0)","v":0}]
[null,{"$f":"data!B219","v":"Gent"},{"$f":"CHOOSE(mySelectionType,\nSQRT((data!D219-control!$C$8)^2+(myAspectRatio*(data!E219-control!$C$9))^2)<=control!$C$17,\nAND(data!D219<=control!$C$8,data!E219>=control!$C$9,data!D219>=control!$C$10,data!E219<=control!$C$11))","v":false},{"$f":"IF($C243,data!D219,NA())","v":{"$error":"#N/A"}},{"$f":"IF($C243,data!E219,NA())","v":{"$error":"#N/A"}},{"$f":"IF($C243,data!F219,0)","v":0}]
[null,{"$f":"data!B220","v":"Elche"},{"$f":"CHOOSE(mySelectionType,\nSQRT((data!D220-control!$C$8)^2+(myAspectRatio*(data!E220-control!$C$9))^2)<=control!$C$17,\nAND(data!D220<=control!$C$8,data!E220>=control!$C$9,data!D220>=control!$C$10,data!E220<=control!$C$11))","v":false},{"$f":"IF($C244,data!D220,NA())","v":{"$error":"#N/A"}},{"$f":"IF($C244,data!E220,NA())","v":{"$error":"#N/A"}},{"$f":"IF($C244,data!F220,0)","v":0}]
[null,{"$f":"data!B221","v":"Magdeburg"},{"$f":"CHOOSE(mySelectionType,\nSQRT((data!D221-control!$C$8)^2+(myAspectRatio*(data!E221-control!$C$9))^2)<=control!$C$17,\nAND(data!D221<=control!$C$8,data!E221>=control!$C$9,data!D221>=control!$C$10,data!E221<=control!$C$11))","v":true},{"$f":"IF($C245,data!D221,NA())","v":52.12773},{"$f":"IF($C245,data!E221,NA())","v":11.629160000000001},{"$f":"IF($C245,data!F221,0)","v":229826}]
[null,{"$f":"data!B222","v":"Ploieşti"},{"$f":"CHOOSE(mySelectionType,\nSQRT((data!D222-control!$C$8)^2+(myAspectRatio*(data!E222-control!$C$9))^2)<=control!$C$17,\nAND(data!D222<=control!$C$8,data!E222>=control!$C$9,data!D222>=control!$C$10,data!E222<=control!$C$11))","v":true},{"$f":"IF($C246,data!D222,NA())","v":44.95},{"$f":"IF($C246,data!E222,NA())","v":26.016670000000001},{"$f":"IF($C246,data!F222,0)","v":228851}]
[null,{"$f":"data!B223","v":"Lille"},{"$f":"CHOOSE(mySelectionType,\nSQRT((data!D223-control!$C$8)^2+(myAspectRatio*(data!E223-control!$C$9))^2)<=control!$C$17,\nAND(data!D223<=control!$C$8,data!E223>=control!$C$9,data!D223>=control!$C$10,data!E223<=control!$C$11))","v":false},{"$f":"IF($C247,data!D223,NA())","v":{"$error":"#N/A"}},{"$f":"IF($C247,data!E223,NA())","v":{"$error":"#N/A"}},{"$f":"IF($C247,data!F223,0)","v":0}]
[null,{"$f":"data!B224","v":"Kremenchuk"},{"$f":"CHOOSE(mySelectionType,\nSQRT((data!D224-control!$C$8)^2+(myAspectRatio*(data!E224-control!$C$9))^2)<=control!$C$17,\nAND(data!D224<=control!$C$8,data!E224>=control!$C$9,data!D224>=control!$C$10,data!E224<=control!$C$11))","v":true},{"$f":"IF($C248,data!D224,NA())","v":49.068019999999997},{"$f":"IF($C248,data!E224,NA())","v":33.420409999999997},{"$f":"IF($C248,data!F224,0)","v":227494}]
[null,{"$f":"data!B225","v":"Sosnowiec"},{"$f":"CHOOSE(mySelectionType,\nSQRT((data!D225-control!$C$8)^2+(myAspectRatio*(data!E225-control!$C$9))^2)<=control!$C$17,\nAND(data!D225<=control!$C$8,data!E225>=control!$C$9,data!D225>=control!$C$10,data!E225<=control!$C$11))","v":true},{"$f":"IF($C249,data!D225,NA())","v":50.286819999999999},{"$f":"IF($C249,data!E225,NA())","v":19.103850000000001},{"$f":"IF($C249,data!F225,0)","v":227295}]
[null,{"$f":"data!B226","v":"Radom"},{"$f":"CHOOSE(mySelectionType,\nSQRT((data!D226-control!$C$8)^2+(myAspectRatio*(data!E226-control!$C$9))^2)<=control!$C$17,\nAND(data!D226<=control!$C$8,data!E226>=control!$C$9,data!D226>=control!$C$10,data!E226<=control!$C$11))","v":true},{"$f":"IF($C250,data!D226,NA())","v":51.402529999999999},{"$f":"IF($C250,data!E226,NA())","v":21.14714},{"$f":"IF($C250,data!F226,0)","v":226794}]
[null,{"$f":"data!B227","v":"Oviedo"},{"$f":"CHOOSE(mySelectionType,\nSQRT((data!D227-control!$C$8)^2+(myAspectRatio*(data!E227-control!$C$9))^2)<=control!$C$17,\nAND(data!D227<=control!$C$8,data!E227>=control!$C$9,data!D227>=control!$C$10,data!E227<=control!$C$11))","v":false},{"$f":"IF($C251,data!D227,NA())","v":{"$error":"#N/A"}},{"$f":"IF($C251,data!E227,NA())","v":{"$error":"#N/A"}},{"$f":"IF($C251,data!F227,0)","v":0}]
[null,{"$f":"data!B228","v":"Adıyaman"},{"$f":"CHOOSE(mySelectionType,\nSQRT((data!D228-control!$C$8)^2+(myAspectRatio*(data!E228-control!$C$9))^2)<=control!$C$17,\nAND(data!D228<=control!$C$8,data!E228>=control!$C$9,data!D228>=control!$C$10,data!E228<=control!$C$11))","v":false},{"$f":"IF($C252,data!D228,NA())","v":{"$error":"#N/A"}},{"$f":"IF($C252,data!E228,NA())","v":{"$error":"#N/A"}},{"$f":"IF($C252,data!F228,0)","v":0}]
[null,{"$f":"data!B229","v":"Graz"},{"$f":"CHOOSE(mySelectionType,\nSQRT((data!D229-control!$C$8)^2+(myAspectRatio*(data!E229-control!$C$9))^2)<=control!$C$17,\nAND(data!D229<=control!$C$8,data!E229>=control!$C$9,data!D229>=control!$C$10,data!E229<=control!$C$11))","v":true},{"$f":"IF($C253,data!D229,NA())","v":47.066670000000002},{"$f":"IF($C253,data!E229,NA())","v":15.45},{"$f":"IF($C253,data!F229,0)","v":222326}]
[null,{"$f":"data!B230","v":"Banja Luka"},{"$f":"CHOOSE(mySelectionType,\nSQRT((data!D230-control!$C$8)^2+(myAspectRatio*(data!E230-control!$C$9))^2)<=control!$C$17,\nAND(data!D230<=control!$C$8,data!E230>=control!$C$9,data!D230>=control!$C$10,data!E230<=control!$C$11))","v":true},{"$f":"IF($C254,data!D230,NA())","v":44.775829999999999},{"$f":"IF($C254,data!E230,NA())","v":17.185559999999999},{"$f":"IF($C254,data!F230,0)","v":221106}]
[null,{"$f":"data!B231","v":"Babruysk"},{"$f":"CHOOSE(mySelectionType,\nSQRT((data!D231-control!$C$8)^2+(myAspectRatio*(data!E231-control!$C$9))^2)<=control!$C$17,\nAND(data!D231<=control!$C$8,data!E231>=control!$C$9,data!D231>=control!$C$10,data!E231<=control!$C$11))","v":true},{"$f":"IF($C255,data!D231,NA())","v":53.138399999999997},{"$f":"IF($C255,data!E231,NA())","v":29.221399999999999},{"$f":"IF($C255,data!F231,0)","v":220517}]
[null,{"$f":"data!B232","v":"Messina"},{"$f":"CHOOSE(mySelectionType,\nSQRT((data!D232-control!$C$8)^2+(myAspectRatio*(data!E232-control!$C$9))^2)<=control!$C$17,\nAND(data!D232<=control!$C$8,data!E232>=control!$C$9,data!D232>=control!$C$10,data!E232<=control!$C$11))","v":false},{"$f":"IF($C256,data!D232,NA())","v":{"$error":"#N/A"}},{"$f":"IF($C256,data!E232,NA())","v":{"$error":"#N/A"}},{"$f":"IF($C256,data!F232,0)","v":0}]
[null,{"$f":"data!B233","v":"Badalona"},{"$f":"CHOOSE(mySelectionType,\nSQRT((data!D233-control!$C$8)^2+(myAspectRatio*(data!E233-control!$C$9))^2)<=control!$C$17,\nAND(data!D233<=control!$C$8,data!E233>=control!$C$9,data!D233>=control!$C$10,data!E233<=control!$C$11))","v":false},{"$f":"IF($C257,data!D233,NA())","v":{"$error":"#N/A"}},{"$f":"IF($C257,data!E233,NA())","v":{"$error":"#N/A"}},{"$f":"IF($C257,data!F233,0)","v":0}]
[null,{"$f":"data!B234","v":"Oberhausen"},{"$f":"CHOOSE(mySelectionType,\nSQRT((data!D234-control!$C$8)^2+(myAspectRatio*(data!E234-control!$C$9))^2)<=control!$C$17,\nAND(data!D234<=control!$C$8,data!E234>=control!$C$9,data!D234>=control!$C$10,data!E234<=control!$C$11))","v":false},{"$f":"IF($C258,data!D234,NA())","v":{"$error":"#N/A"}},{"$f":"IF($C258,data!E234,NA())","v":{"$error":"#N/A"}},{"$f":"IF($C258,data!F234,0)","v":0}]
[null,{"$f":"data!B235","v":"Verona"},{"$f":"CHOOSE(mySelectionType,\nSQRT((data!D235-control!$C$8)^2+(myAspectRatio*(data!E235-control!$C$9))^2)<=control!$C$17,\nAND(data!D235<=control!$C$8,data!E235>=control!$C$9,data!D235>=control!$C$10,data!E235<=control!$C$11))","v":true},{"$f":"IF($C259,data!D235,NA())","v":45.429900000000004},{"$f":"IF($C259,data!E235,NA())","v":10.984439999999999},{"$f":"IF($C259,data!F235,0)","v":219103}]
[null,{"$f":"data!B236","v":"Freiburg"},{"$f":"CHOOSE(mySelectionType,\nSQRT((data!D236-control!$C$8)^2+(myAspectRatio*(data!E236-control!$C$9))^2)<=control!$C$17,\nAND(data!D236<=control!$C$8,data!E236>=control!$C$9,data!D236>=control!$C$10,data!E236<=control!$C$11))","v":true},{"$f":"IF($C260,data!D236,NA())","v":47.995899999999999},{"$f":"IF($C260,data!E236,NA())","v":7.85222},{"$f":"IF($C260,data!F236,0)","v":215966}]
[null,{"$f":"data!B237","v":"Novi Sad"},{"$f":"CHOOSE(mySelectionType,\nSQRT((data!D237-control!$C$8)^2+(myAspectRatio*(data!E237-control!$C$9))^2)<=control!$C$17,\nAND(data!D237<=control!$C$8,data!E237>=control!$C$9,data!D237>=control!$C$10,data!E237<=control!$C$11))","v":true},{"$f":"IF($C261,data!D237,NA())","v":45.251669999999997},{"$f":"IF($C261,data!E237,NA())","v":19.836939999999998},{"$f":"IF($C261,data!F237,0)","v":215400}]
[null,{"$f":"data!B238","v":"Luts’k"},{"$f":"CHOOSE(mySelectionType,\nSQRT((data!D238-control!$C$8)^2+(myAspectRatio*(data!E238-control!$C$9))^2)<=control!$C$17,\nAND(data!D238<=control!$C$8,data!E238>=control!$C$9,data!D238>=control!$C$10,data!E238<=control!$C$11))","v":true},{"$f":"IF($C262,data!D238,NA())","v":50.759320000000002},{"$f":"IF($C262,data!E238,NA())","v":25.34244},{"$f":"IF($C262,data!F238,0)","v":213661}]
[null,{"$f":"data!B239","v":"Bergen"},{"$f":"CHOOSE(mySelectionType,\nSQRT((data!D239-control!$C$8)^2+(myAspectRatio*(data!E239-control!$C$9))^2)<=control!$C$17,\nAND(data!D239<=control!$C$8,data!E239>=control!$C$9,data!D239>=control!$C$10,data!E239<=control!$C$11))","v":false},{"$f":"IF($C263,data!D239,NA())","v":{"$error":"#N/A"}},{"$f":"IF($C263,data!E239,NA())","v":{"$error":"#N/A"}},{"$f":"IF($C263,data!F239,0)","v":0}]
[null,{"$f":"data!B240","v":"Brăila"},{"$f":"CHOOSE(mySelectionType,\nSQRT((data!D240-control!$C$8)^2+(myAspectRatio*(data!E240-control!$C$9))^2)<=control!$C$17,\nAND(data!D240<=control!$C$8,data!E240>=control!$C$9,data!D240>=control!$C$10,data!E240<=control!$C$11))","v":true},{"$f":"IF($C264,data!D240,NA())","v":45.266669999999998},{"$f":"IF($C264,data!E240,NA())","v":27.983329999999999},{"$f":"IF($C264,data!F240,0)","v":213569}]
[null,{"$f":"data!B241","v":"Lübeck"},{"$f":"CHOOSE(mySelectionType,\nSQRT((data!D241-control!$C$8)^2+(myAspectRatio*(data!E241-control!$C$9))^2)<=control!$C$17,\nAND(data!D241<=control!$C$8,data!E241>=control!$C$9,data!D241>=control!$C$10,data!E241<=control!$C$11))","v":true},{"$f":"IF($C265,data!D241,NA())","v":53.868929999999999},{"$f":"IF($C265,data!E241,NA())","v":10.687290000000001},{"$f":"IF($C265,data!F241,0)","v":212207}]
[null,{"$f":"data!B242","v":"Cartagena"},{"$f":"CHOOSE(mySelectionType,\nSQRT((data!D242-control!$C$8)^2+(myAspectRatio*(data!E242-control!$C$9))^2)<=control!$C$17,\nAND(data!D242<=control!$C$8,data!E242>=control!$C$9,data!D242>=control!$C$10,data!E242<=control!$C$11))","v":false},{"$f":"IF($C266,data!D242,NA())","v":{"$error":"#N/A"}},{"$f":"IF($C266,data!E242,NA())","v":{"$error":"#N/A"}},{"$f":"IF($C266,data!F242,0)","v":0}]
[null,{"$f":"data!B243","v":"Kırıkkale"},{"$f":"CHOOSE(mySelectionType,\nSQRT((data!D243-control!$C$8)^2+(myAspectRatio*(data!E243-control!$C$9))^2)<=control!$C$17,\nAND(data!D243<=control!$C$8,data!E243>=control!$C$9,data!D243>=control!$C$10,data!E243<=control!$C$11))","v":false},{"$f":"IF($C267,data!D243,NA())","v":{"$error":"#N/A"}},{"$f":"IF($C267,data!E243,NA())","v":{"$error":"#N/A"}},{"$f":"IF($C267,data!F243,0)","v":0}]
[null,{"$f":"data!B244","v":"Terrassa"},{"$f":"CHOOSE(mySelectionType,\nSQRT((data!D244-control!$C$8)^2+(myAspectRatio*(data!E244-control!$C$9))^2)<=control!$C$17,\nAND(data!D244<=control!$C$8,data!E244>=control!$C$9,data!D244>=control!$C$10,data!E244<=control!$C$11))","v":false},{"$f":"IF($C268,data!D244,NA())","v":{"$error":"#N/A"}},{"$f":"IF($C268,data!E244,NA())","v":{"$error":"#N/A"}},{"$f":"IF($C268,data!F244,0)","v":0}]
[null,{"$f":"data!B245","v":"Antakya"},{"$f":"CHOOSE(mySelectionType,\nSQRT((data!D245-control!$C$8)^2+(myAspectRatio*(data!E245-control!$C$9))^2)<=control!$C$17,\nAND(data!D245<=control!$C$8,data!E245>=control!$C$9,data!D245>=control!$C$10,data!E245<=control!$C$11))","v":false},{"$f":"IF($C269,data!D245,NA())","v":{"$error":"#N/A"}},{"$f":"IF($C269,data!E245,NA())","v":{"$error":"#N/A"}},{"$f":"IF($C269,data!F245,0)","v":0}]
[null,{"$f":"data!B246","v":"Eindhoven"},{"$f":"CHOOSE(mySelectionType,\nSQRT((data!D246-control!$C$8)^2+(myAspectRatio*(data!E246-control!$C$9))^2)<=control!$C$17,\nAND(data!D246<=control!$C$8,data!E246>=control!$C$9,data!D246>=control!$C$10,data!E246<=control!$C$11))","v":false},{"$f":"IF($C270,data!D246,NA())","v":{"$error":"#N/A"}},{"$f":"IF($C270,data!E246,NA())","v":{"$error":"#N/A"}},{"$f":"IF($C270,data!F246,0)","v":0}]
[null,{"$f":"data!B247","v":"Rennes"},{"$f":"CHOOSE(mySelectionType,\nSQRT((data!D247-control!$C$8)^2+(myAspectRatio*(data!E247-control!$C$9))^2)<=control!$C$17,\nAND(data!D247<=control!$C$8,data!E247>=control!$C$9,data!D247>=control!$C$10,data!E247<=control!$C$11))","v":false},{"$f":"IF($C271,data!D247,NA())","v":{"$error":"#N/A"}},{"$f":"IF($C271,data!E247,NA())","v":{"$error":"#N/A"}},{"$f":"IF($C271,data!F247,0)","v":0}]
[null,{"$f":"data!B248","v":"Toruń"},{"$f":"CHOOSE(mySelectionType,\nSQRT((data!D248-control!$C$8)^2+(myAspectRatio*(data!E248-control!$C$9))^2)<=control!$C$17,\nAND(data!D248<=control!$C$8,data!E248>=control!$C$9,data!D248>=control!$C$10,data!E248<=control!$C$11))","v":true},{"$f":"IF($C272,data!D248,NA())","v":53.013750000000002},{"$f":"IF($C272,data!E248,NA())","v":18.598140000000001},{"$f":"IF($C272,data!F248,0)","v":208717}]
[null,{"$f":"data!B249","v":"Kielce"},{"$f":"CHOOSE(mySelectionType,\nSQRT((data!D249-control!$C$8)^2+(myAspectRatio*(data!E249-control!$C$9))^2)<=control!$C$17,\nAND(data!D249<=control!$C$8,data!E249>=control!$C$9,data!D249>=control!$C$10,data!E249<=control!$C$11))","v":true},{"$f":"IF($C273,data!D249,NA())","v":50.870330000000003},{"$f":"IF($C273,data!E249,NA())","v":20.627520000000001},{"$f":"IF($C273,data!F249,0)","v":208598}]
[null,{"$f":"data!B250","v":"Jerez de la Frontera"},{"$f":"CHOOSE(mySelectionType,\nSQRT((data!D250-control!$C$8)^2+(myAspectRatio*(data!E250-control!$C$9))^2)<=control!$C$17,\nAND(data!D250<=control!$C$8,data!E250>=control!$C$9,data!D250>=control!$C$10,data!E250<=control!$C$11))","v":false},{"$f":"IF($C274,data!D250,NA())","v":{"$error":"#N/A"}},{"$f":"IF($C274,data!E250,NA())","v":{"$error":"#N/A"}},{"$f":"IF($C274,data!F250,0)","v":0}]
[null,{"$f":"data!B251","v":"Oradea"},{"$f":"CHOOSE(mySelectionType,\nSQRT((data!D251-control!$C$8)^2+(myAspectRatio*(data!E251-control!$C$9))^2)<=control!$C$17,\nAND(data!D251<=control!$C$8,data!E251>=control!$C$9,data!D251>=control!$C$10,data!E251<=control!$C$11))","v":true},{"$f":"IF($C275,data!D251,NA())","v":47.066670000000002},{"$f":"IF($C275,data!E251,NA())","v":21.933330000000002},{"$f":"IF($C275,data!F251,0)","v":206614}]
[null,{"$f":"data!B252","v":"Sabadell"},{"$f":"CHOOSE(mySelectionType,\nSQRT((data!D252-control!$C$8)^2+(myAspectRatio*(data!E252-control!$C$9))^2)<=control!$C$17,\nAND(data!D252<=control!$C$8,data!E252>=control!$C$9,data!D252>=control!$C$10,data!E252<=control!$C$11))","v":false},{"$f":"IF($C276,data!D252,NA())","v":{"$error":"#N/A"}},{"$f":"IF($C276,data!E252,NA())","v":{"$error":"#N/A"}},{"$f":"IF($C276,data!F252,0)","v":0}]
[null,{"$f":"data!B253","v":"Móstoles"},{"$f":"CHOOSE(mySelectionType,\nSQRT((data!D253-control!$C$8)^2+(myAspectRatio*(data!E253-control!$C$9))^2)<=control!$C$17,\nAND(data!D253<=control!$C$8,data!E253>=control!$C$9,data!D253>=control!$C$10,data!E253<=control!$C$11))","v":false},{"$f":"IF($C277,data!D253,NA())","v":{"$error":"#N/A"}},{"$f":"IF($C277,data!E253,NA())","v":{"$error":"#N/A"}},{"$f":"IF($C277,data!F253,0)","v":0}]
[null,{"$f":"data!B254","v":"Alcalá de Henares"},{"$f":"CHOOSE(mySelectionType,\nSQRT((data!D254-control!$C$8)^2+(myAspectRatio*(data!E254-control!$C$9))^2)<=control!$C$17,\nAND(data!D254<=control!$C$8,data!E254>=control!$C$9,data!D254>=control!$C$10,data!E254<=control!$C$11))","v":false},{"$f":"IF($C278,data!D254,NA())","v":{"$error":"#N/A"}},{"$f":"IF($C278,data!E254,NA())","v":{"$error":"#N/A"}},{"$f":"IF($C278,data!F254,0)","v":0}]
[null,{"$f":"data!B255","v":"Ivano-Frankivs’k"},{"$f":"CHOOSE(mySelectionType,\nSQRT((data!D255-control!$C$8)^2+(myAspectRatio*(data!E255-control!$C$9))^2)<=control!$C$17,\nAND(data!D255<=control!$C$8,data!E255>=control!$C$9,data!D255>=control!$C$10,data!E255<=control!$C$11))","v":true},{"$f":"IF($C279,data!D255,NA())","v":48.921500000000002},{"$f":"IF($C279,data!E255,NA())","v":24.709720000000001},{"$f":"IF($C279,data!F255,0)","v":204200}]
[null,{"$f":"data!B256","v":"Debrecen"},{"$f":"CHOOSE(mySelectionType,\nSQRT((data!D256-control!$C$8)^2+(myAspectRatio*(data!E256-control!$C$9))^2)<=control!$C$17,\nAND(data!D256<=control!$C$8,data!E256>=control!$C$9,data!D256>=control!$C$10,data!E256<=control!$C$11))","v":true},{"$f":"IF($C280,data!D256,NA())","v":47.533329999999999},{"$f":"IF($C280,data!E256,NA())","v":21.633330000000001},{"$f":"IF($C280,data!F256,0)","v":204124}]
[null,{"$f":"data!B257","v":"Padova"},{"$f":"CHOOSE(mySelectionType,\nSQRT((data!D257-control!$C$8)^2+(myAspectRatio*(data!E257-control!$C$9))^2)<=control!$C$17,\nAND(data!D257<=control!$C$8,data!E257>=control!$C$9,data!D257>=control!$C$10,data!E257<=control!$C$11))","v":true},{"$f":"IF($C281,data!D257,NA())","v":45.407969999999999},{"$f":"IF($C281,data!E257,NA())","v":11.885859999999999},{"$f":"IF($C281,data!F257,0)","v":203725}]
[null,{"$f":"data!B258","v":"Erfurt"},{"$f":"CHOOSE(mySelectionType,\nSQRT((data!D258-control!$C$8)^2+(myAspectRatio*(data!E258-control!$C$9))^2)<=control!$C$17,\nAND(data!D258<=control!$C$8,data!E258>=control!$C$9,data!D258>=control!$C$10,data!E258<=control!$C$11))","v":true},{"$f":"IF($C282,data!D258,NA())","v":50.978700000000003},{"$f":"IF($C282,data!E258,NA())","v":11.032830000000001},{"$f":"IF($C282,data!F258,0)","v":203254}]
[null,{"$f":"data!B259","v":"Osmaniye"},{"$f":"CHOOSE(mySelectionType,\nSQRT((data!D259-control!$C$8)^2+(myAspectRatio*(data!E259-control!$C$9))^2)<=control!$C$17,\nAND(data!D259<=control!$C$8,data!E259>=control!$C$9,data!D259>=control!$C$10,data!E259<=control!$C$11))","v":false},{"$f":"IF($C283,data!D259,NA())","v":{"$error":"#N/A"}},{"$f":"IF($C283,data!E259,NA())","v":{"$error":"#N/A"}},{"$f":"IF($C283,data!F259,0)","v":0}]
[null,{"$f":"data!B260","v":"Tampere"},{"$f":"CHOOSE(mySelectionType,\nSQRT((data!D260-control!$C$8)^2+(myAspectRatio*(data!E260-control!$C$9))^2)<=control!$C$17,\nAND(data!D260<=control!$C$8,data!E260>=control!$C$9,data!D260>=control!$C$10,data!E260<=control!$C$11))","v":false},{"$f":"IF($C284,data!D260,NA())","v":{"$error":"#N/A"}},{"$f":"IF($C284,data!E260,NA())","v":{"$error":"#N/A"}},{"$f":"IF($C284,data!F260,0)","v":0}]
[null,{"$f":"data!B261","v":"Çorlu"},{"$f":"CHOOSE(mySelectionType,\nSQRT((data!D261-control!$C$8)^2+(myAspectRatio*(data!E261-control!$C$9))^2)<=control!$C$17,\nAND(data!D261<=control!$C$8,data!E261>=control!$C$9,data!D261>=control!$C$10,data!E261<=control!$C$11))","v":true},{"$f":"IF($C285,data!D261,NA())","v":41.159170000000003},{"$f":"IF($C285,data!E261,NA())","v":27.8},{"$f":"IF($C285,data!F261,0)","v":202578}]
[null,{"$f":"data!B262","v":"Harburg"},{"$f":"CHOOSE(mySelectionType,\nSQRT((data!D262-control!$C$8)^2+(myAspectRatio*(data!E262-control!$C$9))^2)<=control!$C$17,\nAND(data!D262<=control!$C$8,data!E262>=control!$C$9,data!D262>=control!$C$10,data!E262<=control!$C$11))","v":true},{"$f":"IF($C286,data!D262,NA())","v":53.460569999999997},{"$f":"IF($C286,data!E262,NA())","v":9.9838799999999992},{"$f":"IF($C286,data!F262,0)","v":202571}]
[null,{"$f":"data!B263","v":"Charleroi"},{"$f":"CHOOSE(mySelectionType,\nSQRT((data!D263-control!$C$8)^2+(myAspectRatio*(data!E263-control!$C$9))^2)<=control!$C$17,\nAND(data!D263<=control!$C$8,data!E263>=control!$C$9,data!D263>=control!$C$10,data!E263<=control!$C$11))","v":false},{"$f":"IF($C287,data!D263,NA())","v":{"$error":"#N/A"}},{"$f":"IF($C287,data!E263,NA())","v":{"$error":"#N/A"}},{"$f":"IF($C287,data!F263,0)","v":0}]
[null,{"$f":"data!B264","v":"Tilburg"},{"$f":"CHOOSE(mySelectionType,\nSQRT((data!D264-control!$C$8)^2+(myAspectRatio*(data!E264-control!$C$9))^2)<=control!$C$17,\nAND(data!D264<=control!$C$8,data!E264>=control!$C$9,data!D264>=control!$C$10,data!E264<=control!$C$11))","v":false},{"$f":"IF($C288,data!D264,NA())","v":{"$error":"#N/A"}},{"$f":"IF($C288,data!E264,NA())","v":{"$error":"#N/A"}},{"$f":"IF($C288,data!F264,0)","v":0}]
[null,{"$f":"data!B265","v":"Bila Tserkva"},{"$f":"CHOOSE(mySelectionType,\nSQRT((data!D265-control!$C$8)^2+(myAspectRatio*(data!E265-control!$C$9))^2)<=control!$C$17,\nAND(data!D265<=control!$C$8,data!E265>=control!$C$9,data!D265>=control!$C$10,data!E265<=control!$C$11))","v":true},{"$f":"IF($C289,data!D265,NA())","v":49.80939},{"$f":"IF($C289,data!E265,NA())","v":30.112089999999998},{"$f":"IF($C289,data!F265,0)","v":199163}]
[null,{"$f":"data!B266","v":"Dudley"},{"$f":"CHOOSE(mySelectionType,\nSQRT((data!D266-control!$C$8)^2+(myAspectRatio*(data!E266-control!$C$9))^2)<=control!$C$17,\nAND(data!D266<=control!$C$8,data!E266>=control!$C$9,data!D266>=control!$C$10,data!E266<=control!$C$11))","v":false},{"$f":"IF($C290,data!D266,NA())","v":{"$error":"#N/A"}},{"$f":"IF($C290,data!E266,NA())","v":{"$error":"#N/A"}},{"$f":"IF($C290,data!F266,0)","v":0}]
[null,{"$f":"data!B267","v":"Hagen"},{"$f":"CHOOSE(mySelectionType,\nSQRT((data!D267-control!$C$8)^2+(myAspectRatio*(data!E267-control!$C$9))^2)<=control!$C$17,\nAND(data!D267<=control!$C$8,data!E267>=control!$C$9,data!D267>=control!$C$10,data!E267<=control!$C$11))","v":false},{"$f":"IF($C291,data!D267,NA())","v":{"$error":"#N/A"}},{"$f":"IF($C291,data!E267,NA())","v":{"$error":"#N/A"}},{"$f":"IF($C291,data!F267,0)","v":0}]
[null,{"$f":"data!B268","v":"Gliwice"},{"$f":"CHOOSE(mySelectionType,\nSQRT((data!D268-control!$C$8)^2+(myAspectRatio*(data!E268-control!$C$9))^2)<=control!$C$17,\nAND(data!D268<=control!$C$8,data!E268>=control!$C$9,data!D268>=control!$C$10,data!E268<=control!$C$11))","v":true},{"$f":"IF($C292,data!D268,NA())","v":50.297609999999999},{"$f":"IF($C292,data!E268,NA())","v":18.676580000000001},{"$f":"IF($C292,data!F268,0)","v":198835}]
[null,{"$f":"data!B269","v":"Pamplona"},{"$f":"CHOOSE(mySelectionType,\nSQRT((data!D269-control!$C$8)^2+(myAspectRatio*(data!E269-control!$C$9))^2)<=control!$C$17,\nAND(data!D269<=control!$C$8,data!E269>=control!$C$9,data!D269>=control!$C$10,data!E269<=control!$C$11))","v":false},{"$f":"IF($C293,data!D269,NA())","v":{"$error":"#N/A"}},{"$f":"IF($C293,data!E269,NA())","v":{"$error":"#N/A"}},{"$f":"IF($C293,data!F269,0)","v":0}]
[null,{"$f":"data!B270","v":"Rostock"},{"$f":"CHOOSE(mySelectionType,\nSQRT((data!D270-control!$C$8)^2+(myAspectRatio*(data!E270-control!$C$9))^2)<=control!$C$17,\nAND(data!D270<=control!$C$8,data!E270>=control!$C$9,data!D270>=control!$C$10,data!E270<=control!$C$11))","v":true},{"$f":"IF($C294,data!D270,NA())","v":54.088700000000003},{"$f":"IF($C294,data!E270,NA())","v":12.14049},{"$f":"IF($C294,data!F270,0)","v":198293}]
[null,{"$f":"data!B271","v":"Fuenlabrada"},{"$f":"CHOOSE(mySelectionType,\nSQRT((data!D271-control!$C$8)^2+(myAspectRatio*(data!E271-control!$C$9))^2)<=control!$C$17,\nAND(data!D271<=control!$C$8,data!E271>=control!$C$9,data!D271>=control!$C$10,data!E271<=control!$C$11))","v":false},{"$f":"IF($C295,data!D271,NA())","v":{"$error":"#N/A"}},{"$f":"IF($C295,data!E271,NA())","v":{"$error":"#N/A"}},{"$f":"IF($C295,data!F271,0)","v":0}]
[null,{"$f":"data!B272","v":"Northampton"},{"$f":"CHOOSE(mySelectionType,\nSQRT((data!D272-control!$C$8)^2+(myAspectRatio*(data!E272-control!$C$9))^2)<=control!$C$17,\nAND(data!D272<=control!$C$8,data!E272>=control!$C$9,data!D272>=control!$C$10,data!E272<=control!$C$11))","v":false},{"$f":"IF($C296,data!D272,NA())","v":{"$error":"#N/A"}},{"$f":"IF($C296,data!E272,NA())","v":{"$error":"#N/A"}},{"$f":"IF($C296,data!F272,0)","v":0}]
[null,{"$f":"data!B273","v":"İzmit"},{"$f":"CHOOSE(mySelectionType,\nSQRT((data!D273-control!$C$8)^2+(myAspectRatio*(data!E273-control!$C$9))^2)<=control!$C$17,\nAND(data!D273<=control!$C$8,data!E273>=control!$C$9,data!D273>=control!$C$10,data!E273<=control!$C$11))","v":true},{"$f":"IF($C297,data!D273,NA())","v":40.766939999999998},{"$f":"IF($C297,data!E273,NA())","v":29.91694},{"$f":"IF($C297,data!F273,0)","v":196571}]
[null,{"$f":"data!B274","v":"Reims"},{"$f":"CHOOSE(mySelectionType,\nSQRT((data!D274-control!$C$8)^2+(myAspectRatio*(data!E274-control!$C$9))^2)<=control!$C$17,\nAND(data!D274<=control!$C$8,data!E274>=control!$C$9,data!D274>=control!$C$10,data!E274<=control!$C$11))","v":false},{"$f":"IF($C298,data!D274,NA())","v":{"$error":"#N/A"}},{"$f":"IF($C298,data!E274,NA())","v":{"$error":"#N/A"}},{"$f":"IF($C298,data!F274,0)","v":0}]
[null,{"$f":"data!B275","v":"Burgas"},{"$f":"CHOOSE(mySelectionType,\nSQRT((data!D275-control!$C$8)^2+(myAspectRatio*(data!E275-control!$C$9))^2)<=control!$C$17,\nAND(data!D275<=control!$C$8,data!E275>=control!$C$9,data!D275>=control!$C$10,data!E275<=control!$C$11))","v":true},{"$f":"IF($C299,data!D275,NA())","v":42.506059999999998},{"$f":"IF($C299,data!E275,NA())","v":27.46781},{"$f":"IF($C299,data!F275,0)","v":195966}]
[null,{"$f":"data!B276","v":"Kassel"},{"$f":"CHOOSE(mySelectionType,\nSQRT((data!D276-control!$C$8)^2+(myAspectRatio*(data!E276-control!$C$9))^2)<=control!$C$17,\nAND(data!D276<=control!$C$8,data!E276>=control!$C$9,data!D276>=control!$C$10,data!E276<=control!$C$11))","v":true},{"$f":"IF($C300,data!D276,NA())","v":51.316670000000002},{"$f":"IF($C300,data!E276,NA())","v":9.5},{"$f":"IF($C300,data!F276,0)","v":194501}]
[null,{"$f":"data!B277","v":"Portsmouth"},{"$f":"CHOOSE(mySelectionType,\nSQRT((data!D277-control!$C$8)^2+(myAspectRatio*(data!E277-control!$C$9))^2)<=control!$C$17,\nAND(data!D277<=control!$C$8,data!E277>=control!$C$9,data!D277>=control!$C$10,data!E277<=control!$C$11))","v":false},{"$f":"IF($C301,data!D277,NA())","v":{"$error":"#N/A"}},{"$f":"IF($C301,data!E277,NA())","v":{"$error":"#N/A"}},{"$f":"IF($C301,data!F277,0)","v":0}]
[null,{"$f":"data!B278","v":"Luton"},{"$f":"CHOOSE(mySelectionType,\nSQRT((data!D278-control!$C$8)^2+(myAspectRatio*(data!E278-control!$C$9))^2)<=control!$C$17,\nAND(data!D278<=control!$C$8,data!E278>=control!$C$9,data!D278>=control!$C$10,data!E278<=control!$C$11))","v":false},{"$f":"IF($C302,data!D278,NA())","v":{"$error":"#N/A"}},{"$f":"IF($C302,data!E278,NA())","v":{"$error":"#N/A"}},{"$f":"IF($C302,data!F278,0)","v":0}]
[null,{"$f":"data!B279","v":"Newcastle upon Tyne"},{"$f":"CHOOSE(mySelectionType,\nSQRT((data!D279-control!$C$8)^2+(myAspectRatio*(data!E279-control!$C$9))^2)<=control!$C$17,\nAND(data!D279<=control!$C$8,data!E279>=control!$C$9,data!D279>=control!$C$10,data!E279<=control!$C$11))","v":false},{"$f":"IF($C303,data!D279,NA())","v":{"$error":"#N/A"}},{"$f":"IF($C303,data!E279,NA())","v":{"$error":"#N/A"}},{"$f":"IF($C303,data!F279,0)","v":0}]
[null,{"$f":"data!B280","v":"Klaipėda"},{"$f":"CHOOSE(mySelectionType,\nSQRT((data!D280-control!$C$8)^2+(myAspectRatio*(data!E280-control!$C$9))^2)<=control!$C$17,\nAND(data!D280<=control!$C$8,data!E280>=control!$C$9,data!D280>=control!$C$10,data!E280<=control!$C$11))","v":true},{"$f":"IF($C304,data!D280,NA())","v":55.717219999999998},{"$f":"IF($C304,data!E280,NA())","v":21.1175},{"$f":"IF($C304,data!F280,0)","v":192307}]
[null,{"$f":"data!B281","v":"Zabrze"},{"$f":"CHOOSE(mySelectionType,\nSQRT((data!D281-control!$C$8)^2+(myAspectRatio*(data!E281-control!$C$9))^2)<=control!$C$17,\nAND(data!D281<=control!$C$8,data!E281>=control!$C$9,data!D281>=control!$C$10,data!E281<=control!$C$11))","v":true},{"$f":"IF($C305,data!D281,NA())","v":50.324919999999999},{"$f":"IF($C305,data!E281,NA())","v":18.78576},{"$f":"IF($C305,data!F281,0)","v":192177}]
[null,{"$f":"data!B282","v":"Preston"},{"$f":"CHOOSE(mySelectionType,\nSQRT((data!D282-control!$C$8)^2+(myAspectRatio*(data!E282-control!$C$9))^2)<=control!$C$17,\nAND(data!D282<=control!$C$8,data!E282>=control!$C$9,data!D282>=control!$C$10,data!E282<=control!$C$11))","v":false},{"$f":"IF($C306,data!D282,NA())","v":{"$error":"#N/A"}},{"$f":"IF($C306,data!E282,NA())","v":{"$error":"#N/A"}},{"$f":"IF($C306,data!F282,0)","v":0}]
[null,{"$f":"data!B283","v":"Cork"},{"$f":"CHOOSE(mySelectionType,\nSQRT((data!D283-control!$C$8)^2+(myAspectRatio*(data!E283-control!$C$9))^2)<=control!$C$17,\nAND(data!D283<=control!$C$8,data!E283>=control!$C$9,data!D283>=control!$C$10,data!E283<=control!$C$11))","v":false},{"$f":"IF($C307,data!D283,NA())","v":{"$error":"#N/A"}},{"$f":"IF($C307,data!E283,NA())","v":{"$error":"#N/A"}},{"$f":"IF($C307,data!F283,0)","v":0}]
[null,{"$f":"data!B284","v":"Vantaa"},{"$f":"CHOOSE(mySelectionType,\nSQRT((data!D284-control!$C$8)^2+(myAspectRatio*(data!E284-control!$C$9))^2)<=control!$C$17,\nAND(data!D284<=control!$C$8,data!E284>=control!$C$9,data!D284>=control!$C$10,data!E284<=control!$C$11))","v":true},{"$f":"IF($C308,data!D284,NA())","v":60.294139999999999},{"$f":"IF($C308,data!E284,NA())","v":25.040990000000001},{"$f":"IF($C308,data!F284,0)","v":190058}]
[null,{"$f":"data!B285","v":"Bytom"},{"$f":"CHOOSE(mySelectionType,\nSQRT((data!D285-control!$C$8)^2+(myAspectRatio*(data!E285-control!$C$9))^2)<=control!$C$17,\nAND(data!D285<=control!$C$8,data!E285>=control!$C$9,data!D285>=control!$C$10,data!E285<=control!$C$11))","v":true},{"$f":"IF($C309,data!D285,NA())","v":50.348019999999998},{"$f":"IF($C309,data!E285,NA())","v":18.93282},{"$f":"IF($C309,data!F285,0)","v":189186}]
[null,{"$f":"data!B286","v":"Almería"},{"$f":"CHOOSE(mySelectionType,\nSQRT((data!D286-control!$C$8)^2+(myAspectRatio*(data!E286-control!$C$9))^2)<=control!$C$17,\nAND(data!D286<=control!$C$8,data!E286>=control!$C$9,data!D286>=control!$C$10,data!E286<=control!$C$11))","v":false},{"$f":"IF($C310,data!D286,NA())","v":{"$error":"#N/A"}},{"$f":"IF($C310,data!E286,NA())","v":{"$error":"#N/A"}},{"$f":"IF($C310,data!F286,0)","v":0}]
[null,{"$f":"data!B287","v":"Trieste"},{"$f":"CHOOSE(mySelectionType,\nSQRT((data!D287-control!$C$8)^2+(myAspectRatio*(data!E287-control!$C$9))^2)<=control!$C$17,\nAND(data!D287<=control!$C$8,data!E287>=control!$C$9,data!D287>=control!$C$10,data!E287<=control!$C$11))","v":true},{"$f":"IF($C311,data!D287,NA())","v":45.643250000000002},{"$f":"IF($C311,data!E287,NA())","v":13.7903},{"$f":"IF($C311,data!F287,0)","v":187056}]
[null,{"$f":"data!B288","v":"Leganés"},{"$f":"CHOOSE(mySelectionType,\nSQRT((data!D288-control!$C$8)^2+(myAspectRatio*(data!E288-control!$C$9))^2)<=control!$C$17,\nAND(data!D288<=control!$C$8,data!E288>=control!$C$9,data!D288>=control!$C$10,data!E288<=control!$C$11))","v":false},{"$f":"IF($C312,data!D288,NA())","v":{"$error":"#N/A"}},{"$f":"IF($C312,data!E288,NA())","v":{"$error":"#N/A"}},{"$f":"IF($C312,data!F288,0)","v":0}]
[null,{"$f":"data!B289","v":"Le Havre"},{"$f":"CHOOSE(mySelectionType,\nSQRT((data!D289-control!$C$8)^2+(myAspectRatio*(data!E289-control!$C$9))^2)<=control!$C$17,\nAND(data!D289<=control!$C$8,data!E289>=control!$C$9,data!D289>=control!$C$10,data!E289<=control!$C$11))","v":false},{"$f":"IF($C313,data!D289,NA())","v":{"$error":"#N/A"}},{"$f":"IF($C313,data!E289,NA())","v":{"$error":"#N/A"}},{"$f":"IF($C313,data!F289,0)","v":0}]
[null,{"$f":"data!B290","v":"Dún Laoghaire"},{"$f":"CHOOSE(mySelectionType,\nSQRT((data!D290-control!$C$8)^2+(myAspectRatio*(data!E290-control!$C$9))^2)<=control!$C$17,\nAND(data!D290<=control!$C$8,data!E290>=control!$C$9,data!D290>=control!$C$10,data!E290<=control!$C$11))","v":false},{"$f":"IF($C314,data!D290,NA())","v":{"$error":"#N/A"}},{"$f":"IF($C314,data!E290,NA())","v":{"$error":"#N/A"}},{"$f":"IF($C314,data!F290,0)","v":0}]
[null,{"$f":"data!B291","v":"Donostia / San Sebastián"},{"$f":"CHOOSE(mySelectionType,\nSQRT((data!D291-control!$C$8)^2+(myAspectRatio*(data!E291-control!$C$9))^2)<=control!$C$17,\nAND(data!D291<=control!$C$8,data!E291>=control!$C$9,data!D291>=control!$C$10,data!E291<=control!$C$11))","v":false},{"$f":"IF($C315,data!D291,NA())","v":{"$error":"#N/A"}},{"$f":"IF($C315,data!E291,NA())","v":{"$error":"#N/A"}},{"$f":"IF($C315,data!F291,0)","v":0}]
[null,{"$f":"data!B292","v":"Hamm"},{"$f":"CHOOSE(mySelectionType,\nSQRT((data!D292-control!$C$8)^2+(myAspectRatio*(data!E292-control!$C$9))^2)<=control!$C$17,\nAND(data!D292<=control!$C$8,data!E292>=control!$C$9,data!D292>=control!$C$10,data!E292<=control!$C$11))","v":false},{"$f":"IF($C316,data!D292,NA())","v":{"$error":"#N/A"}},{"$f":"IF($C316,data!E292,NA())","v":{"$error":"#N/A"}},{"$f":"IF($C316,data!F292,0)","v":0}]
[null,{"$f":"data!B293","v":"Kütahya"},{"$f":"CHOOSE(mySelectionType,\nSQRT((data!D293-control!$C$8)^2+(myAspectRatio*(data!E293-control!$C$9))^2)<=control!$C$17,\nAND(data!D293<=control!$C$8,data!E293>=control!$C$9,data!D293>=control!$C$10,data!E293<=control!$C$11))","v":false},{"$f":"IF($C317,data!D293,NA())","v":{"$error":"#N/A"}},{"$f":"IF($C317,data!E293,NA())","v":{"$error":"#N/A"}},{"$f":"IF($C317,data!F293,0)","v":0}]
[null,{"$f":"data!B294","v":"Mainz"},{"$f":"CHOOSE(mySelectionType,\nSQRT((data!D294-control!$C$8)^2+(myAspectRatio*(data!E294-control!$C$9))^2)<=control!$C$17,\nAND(data!D294<=control!$C$8,data!E294>=control!$C$9,data!D294>=control!$C$10,data!E294<=control!$C$11))","v":true},{"$f":"IF($C318,data!D294,NA())","v":49.984189999999998},{"$f":"IF($C318,data!E294,NA())","v":8.2790999999999997},{"$f":"IF($C318,data!F294,0)","v":184997}]
[null,{"$f":"data!B295","v":"Brescia"},{"$f":"CHOOSE(mySelectionType,\nSQRT((data!D295-control!$C$8)^2+(myAspectRatio*(data!E295-control!$C$9))^2)<=control!$C$17,\nAND(data!D295<=control!$C$8,data!E295>=control!$C$9,data!D295>=control!$C$10,data!E295<=control!$C$11))","v":true},{"$f":"IF($C319,data!D295,NA())","v":45.535580000000003},{"$f":"IF($C319,data!E295,NA())","v":10.21472},{"$f":"IF($C319,data!F295,0)","v":184826}]
[null,{"$f":"data!B296","v":"Milton Keynes"},{"$f":"CHOOSE(mySelectionType,\nSQRT((data!D296-control!$C$8)^2+(myAspectRatio*(data!E296-control!$C$9))^2)<=control!$C$17,\nAND(data!D296<=control!$C$8,data!E296>=control!$C$9,data!D296>=control!$C$10,data!E296<=control!$C$11))","v":false},{"$f":"IF($C320,data!D296,NA())","v":{"$error":"#N/A"}},{"$f":"IF($C320,data!E296,NA())","v":{"$error":"#N/A"}},{"$f":"IF($C320,data!F296,0)","v":0}]
[null,{"$f":"data!B297","v":"Genève"},{"$f":"CHOOSE(mySelectionType,\nSQRT((data!D297-control!$C$8)^2+(myAspectRatio*(data!E297-control!$C$9))^2)<=control!$C$17,\nAND(data!D297<=control!$C$8,data!E297>=control!$C$9,data!D297>=control!$C$10,data!E297<=control!$C$11))","v":false},{"$f":"IF($C321,data!D297,NA())","v":{"$error":"#N/A"}},{"$f":"IF($C321,data!E297,NA())","v":{"$error":"#N/A"}},{"$f":"IF($C321,data!F297,0)","v":0}]
[null,{"$f":"data!B298","v":"Aberdeen"},{"$f":"CHOOSE(mySelectionType,\nSQRT((data!D298-control!$C$8)^2+(myAspectRatio*(data!E298-control!$C$9))^2)<=control!$C$17,\nAND(data!D298<=control!$C$8,data!E298>=control!$C$9,data!D298>=control!$C$10,data!E298<=control!$C$11))","v":false},{"$f":"IF($C322,data!D298,NA())","v":{"$error":"#N/A"}},{"$f":"IF($C322,data!E298,NA())","v":{"$error":"#N/A"}},{"$f":"IF($C322,data!F298,0)","v":0}]
[null,{"$f":"data!B299","v":"Cergy-Pontoise"},{"$f":"CHOOSE(mySelectionType,\nSQRT((data!D299-control!$C$8)^2+(myAspectRatio*(data!E299-control!$C$9))^2)<=control!$C$17,\nAND(data!D299<=control!$C$8,data!E299>=control!$C$9,data!D299>=control!$C$10,data!E299<=control!$C$11))","v":false},{"$f":"IF($C323,data!D299,NA())","v":{"$error":"#N/A"}},{"$f":"IF($C323,data!E299,NA())","v":{"$error":"#N/A"}},{"$f":"IF($C323,data!F299,0)","v":0}]
[null,{"$f":"data!B300","v":"Çorum"},{"$f":"CHOOSE(mySelectionType,\nSQRT((data!D300-control!$C$8)^2+(myAspectRatio*(data!E300-control!$C$9))^2)<=control!$C$17,\nAND(data!D300<=control!$C$8,data!E300>=control!$C$9,data!D300>=control!$C$10,data!E300<=control!$C$11))","v":false},{"$f":"IF($C324,data!D300,NA())","v":{"$error":"#N/A"}},{"$f":"IF($C324,data!E300,NA())","v":{"$error":"#N/A"}},{"$f":"IF($C324,data!F300,0)","v":0}]
[null,{"$f":"data!B301","v":"Santander"},{"$f":"CHOOSE(mySelectionType,\nSQRT((data!D301-control!$C$8)^2+(myAspectRatio*(data!E301-control!$C$9))^2)<=control!$C$17,\nAND(data!D301<=control!$C$8,data!E301>=control!$C$9,data!D301>=control!$C$10,data!E301<=control!$C$11))","v":false},{"$f":"IF($C325,data!D301,NA())","v":{"$error":"#N/A"}},{"$f":"IF($C325,data!E301,NA())","v":{"$error":"#N/A"}},{"$f":"IF($C325,data!F301,0)","v":0}]
[null,{"$f":"data!B302","v":"Liège"},{"$f":"CHOOSE(mySelectionType,\nSQRT((data!D302-control!$C$8)^2+(myAspectRatio*(data!E302-control!$C$9))^2)<=control!$C$17,\nAND(data!D302<=control!$C$8,data!E302>=control!$C$9,data!D302>=control!$C$10,data!E302<=control!$C$11))","v":false},{"$f":"IF($C326,data!D302,NA())","v":{"$error":"#N/A"}},{"$f":"IF($C326,data!E302,NA())","v":{"$error":"#N/A"}},{"$f":"IF($C326,data!F302,0)","v":0}]
[null,{"$f":"data!B303","v":"Prato"},{"$f":"CHOOSE(mySelectionType,\nSQRT((data!D303-control!$C$8)^2+(myAspectRatio*(data!E303-control!$C$9))^2)<=control!$C$17,\nAND(data!D303<=control!$C$8,data!E303>=control!$C$9,data!D303>=control!$C$10,data!E303<=control!$C$11))","v":true},{"$f":"IF($C327,data!D303,NA())","v":43.873089999999998},{"$f":"IF($C327,data!E303,NA())","v":11.08278},{"$f":"IF($C327,data!F303,0)","v":181820}]
[null,{"$f":"data!B304","v":"Saarbrücken"},{"$f":"CHOOSE(mySelectionType,\nSQRT((data!D304-control!$C$8)^2+(myAspectRatio*(data!E304-control!$C$9))^2)<=control!$C$17,\nAND(data!D304<=control!$C$8,data!E304>=control!$C$9,data!D304>=control!$C$10,data!E304<=control!$C$11))","v":false},{"$f":"IF($C328,data!D304,NA())","v":{"$error":"#N/A"}},{"$f":"IF($C328,data!E304,NA())","v":{"$error":"#N/A"}},{"$f":"IF($C328,data!F304,0)","v":0}]
[null,{"$f":"data!B305","v":"Groningen"},{"$f":"CHOOSE(mySelectionType,\nSQRT((data!D305-control!$C$8)^2+(myAspectRatio*(data!E305-control!$C$9))^2)<=control!$C$17,\nAND(data!D305<=control!$C$8,data!E305>=control!$C$9,data!D305>=control!$C$10,data!E305<=control!$C$11))","v":false},{"$f":"IF($C329,data!D305,NA())","v":{"$error":"#N/A"}},{"$f":"IF($C329,data!E305,NA())","v":{"$error":"#N/A"}},{"$f":"IF($C329,data!F305,0)","v":0}]
[null,{"$f":"data!B306","v":"Linz"},{"$f":"CHOOSE(mySelectionType,\nSQRT((data!D306-control!$C$8)^2+(myAspectRatio*(data!E306-control!$C$9))^2)<=control!$C$17,\nAND(data!D306<=control!$C$8,data!E306>=control!$C$9,data!D306>=control!$C$10,data!E306<=control!$C$11))","v":true},{"$f":"IF($C330,data!D306,NA())","v":48.30639},{"$f":"IF($C330,data!E306,NA())","v":14.286110000000001},{"$f":"IF($C330,data!F306,0)","v":181162}]
[null,{"$f":"data!B307","v":"Taranto"},{"$f":"CHOOSE(mySelectionType,\nSQRT((data!D307-control!$C$8)^2+(myAspectRatio*(data!E307-control!$C$9))^2)<=control!$C$17,\nAND(data!D307<=control!$C$8,data!E307>=control!$C$9,data!D307>=control!$C$10,data!E307<=control!$C$11))","v":true},{"$f":"IF($C331,data!D307,NA())","v":40.41639},{"$f":"IF($C331,data!E307,NA())","v":17.25478},{"$f":"IF($C331,data!F307,0)","v":181082}]
[null,{"$f":"data!B308","v":"Castelló de la Plana"},{"$f":"CHOOSE(mySelectionType,\nSQRT((data!D308-control!$C$8)^2+(myAspectRatio*(data!E308-control!$C$9))^2)<=control!$C$17,\nAND(data!D308<=control!$C$8,data!E308>=control!$C$9,data!D308>=control!$C$10,data!E308<=control!$C$11))","v":false},{"$f":"IF($C332,data!D308,NA())","v":{"$error":"#N/A"}},{"$f":"IF($C332,data!E308,NA())","v":{"$error":"#N/A"}},{"$f":"IF($C332,data!F308,0)","v":0}]
[null,{"$f":"data!B309","v":"Burgos"},{"$f":"CHOOSE(mySelectionType,\nSQRT((data!D309-control!$C$8)^2+(myAspectRatio*(data!E309-control!$C$9))^2)<=control!$C$17,\nAND(data!D309<=control!$C$8,data!E309>=control!$C$9,data!D309>=control!$C$10,data!E309<=control!$C$11))","v":false},{"$f":"IF($C333,data!D309,NA())","v":{"$error":"#N/A"}},{"$f":"IF($C333,data!E309,NA())","v":{"$error":"#N/A"}},{"$f":"IF($C333,data!F309,0)","v":0}]
[null,{"$f":"data!B310","v":"Amadora"},{"$f":"CHOOSE(mySelectionType,\nSQRT((data!D310-control!$C$8)^2+(myAspectRatio*(data!E310-control!$C$9))^2)<=control!$C$17,\nAND(data!D310<=control!$C$8,data!E310>=control!$C$9,data!D310>=control!$C$10,data!E310<=control!$C$11))","v":false},{"$f":"IF($C334,data!D310,NA())","v":{"$error":"#N/A"}},{"$f":"IF($C334,data!E310,NA())","v":{"$error":"#N/A"}},{"$f":"IF($C334,data!F310,0)","v":0}]
[null,{"$f":"data!B311","v":"Sunderland"},{"$f":"CHOOSE(mySelectionType,\nSQRT((data!D311-control!$C$8)^2+(myAspectRatio*(data!E311-control!$C$9))^2)<=control!$C$17,\nAND(data!D311<=control!$C$8,data!E311>=control!$C$9,data!D311>=control!$C$10,data!E311<=control!$C$11))","v":false},{"$f":"IF($C335,data!D311,NA())","v":{"$error":"#N/A"}},{"$f":"IF($C335,data!E311,NA())","v":{"$error":"#N/A"}},{"$f":"IF($C335,data!F311,0)","v":0}]
[null,{"$f":"data!B312","v":"Norwich"},{"$f":"CHOOSE(mySelectionType,\nSQRT((data!D312-control!$C$8)^2+(myAspectRatio*(data!E312-control!$C$9))^2)<=control!$C$17,\nAND(data!D312<=control!$C$8,data!E312>=control!$C$9,data!D312>=control!$C$10,data!E312<=control!$C$11))","v":false},{"$f":"IF($C336,data!D312,NA())","v":{"$error":"#N/A"}},{"$f":"IF($C336,data!E312,NA())","v":{"$error":"#N/A"}},{"$f":"IF($C336,data!F312,0)","v":0}]
[null,{"$f":"data!B313","v":"Bielsko-Biala"},{"$f":"CHOOSE(mySelectionType,\nSQRT((data!D313-control!$C$8)^2+(myAspectRatio*(data!E313-control!$C$9))^2)<=control!$C$17,\nAND(data!D313<=control!$C$8,data!E313>=control!$C$9,data!D313>=control!$C$10,data!E313<=control!$C$11))","v":true},{"$f":"IF($C337,data!D313,NA())","v":49.822450000000003},{"$f":"IF($C337,data!E313,NA())","v":19.046859999999999},{"$f":"IF($C337,data!F313,0)","v":176515}]
[null,{"$f":"data!B314","v":"Almere Stad"},{"$f":"CHOOSE(mySelectionType,\nSQRT((data!D314-control!$C$8)^2+(myAspectRatio*(data!E314-control!$C$9))^2)<=control!$C$17,\nAND(data!D314<=control!$C$8,data!E314>=control!$C$9,data!D314>=control!$C$10,data!E314<=control!$C$11))","v":false},{"$f":"IF($C338,data!D314,NA())","v":{"$error":"#N/A"}},{"$f":"IF($C338,data!E314,NA())","v":{"$error":"#N/A"}},{"$f":"IF($C338,data!F314,0)","v":0}]
[null,{"$f":"data!B315","v":"Split"},{"$f":"CHOOSE(mySelectionType,\nSQRT((data!D315-control!$C$8)^2+(myAspectRatio*(data!E315-control!$C$9))^2)<=control!$C$17,\nAND(data!D315<=control!$C$8,data!E315>=control!$C$9,data!D315>=control!$C$10,data!E315<=control!$C$11))","v":true},{"$f":"IF($C339,data!D315,NA())","v":43.50891},{"$f":"IF($C339,data!E315,NA())","v":16.439150000000001},{"$f":"IF($C339,data!F315,0)","v":176314}]
[null,{"$f":"data!B316","v":"Saint-Étienne"},{"$f":"CHOOSE(mySelectionType,\nSQRT((data!D316-control!$C$8)^2+(myAspectRatio*(data!E316-control!$C$9))^2)<=control!$C$17,\nAND(data!D316<=control!$C$8,data!E316>=control!$C$9,data!D316>=control!$C$10,data!E316<=control!$C$11))","v":false},{"$f":"IF($C340,data!D316,NA())","v":{"$error":"#N/A"}},{"$f":"IF($C340,data!E316,NA())","v":{"$error":"#N/A"}},{"$f":"IF($C340,data!F316,0)","v":0}]
[null,{"$f":"data!B317","v":"Turku"},{"$f":"CHOOSE(mySelectionType,\nSQRT((data!D317-control!$C$8)^2+(myAspectRatio*(data!E317-control!$C$9))^2)<=control!$C$17,\nAND(data!D317<=control!$C$8,data!E317>=control!$C$9,data!D317>=control!$C$10,data!E317<=control!$C$11))","v":true},{"$f":"IF($C341,data!D317,NA())","v":60.451479999999997},{"$f":"IF($C341,data!E317,NA())","v":22.268689999999999},{"$f":"IF($C341,data!F317,0)","v":175945}]
[null,{"$f":"data!B318","v":"Siverek"},{"$f":"CHOOSE(mySelectionType,\nSQRT((data!D318-control!$C$8)^2+(myAspectRatio*(data!E318-control!$C$9))^2)<=control!$C$17,\nAND(data!D318<=control!$C$8,data!E318>=control!$C$9,data!D318>=control!$C$10,data!E318<=control!$C$11))","v":false},{"$f":"IF($C342,data!D318,NA())","v":{"$error":"#N/A"}},{"$f":"IF($C342,data!E318,NA())","v":{"$error":"#N/A"}},{"$f":"IF($C342,data!F318,0)","v":0}]
[null,{"$f":"data!B319","v":"Kramators’k"},{"$f":"CHOOSE(mySelectionType,\nSQRT((data!D319-control!$C$8)^2+(myAspectRatio*(data!E319-control!$C$9))^2)<=control!$C$17,\nAND(data!D319<=control!$C$8,data!E319>=control!$C$9,data!D319>=control!$C$10,data!E319<=control!$C$11))","v":false},{"$f":"IF($C343,data!D319,NA())","v":{"$error":"#N/A"}},{"$f":"IF($C343,data!E319,NA())","v":{"$error":"#N/A"}},{"$f":"IF($C343,data!F319,0)","v":0}]
[null,{"$f":"data!B320","v":"Miskolc"},{"$f":"CHOOSE(mySelectionType,\nSQRT((data!D320-control!$C$8)^2+(myAspectRatio*(data!E320-control!$C$9))^2)<=control!$C$17,\nAND(data!D320<=control!$C$8,data!E320>=control!$C$9,data!D320>=control!$C$10,data!E320<=control!$C$11))","v":true},{"$f":"IF($C344,data!D320,NA())","v":48.1},{"$f":"IF($C344,data!E320,NA())","v":20.783329999999999},{"$f":"IF($C344,data!F320,0)","v":172637}]
[null,{"$f":"data!B321","v":"Walsall"},{"$f":"CHOOSE(mySelectionType,\nSQRT((data!D321-control!$C$8)^2+(myAspectRatio*(data!E321-control!$C$9))^2)<=control!$C$17,\nAND(data!D321<=control!$C$8,data!E321>=control!$C$9,data!D321>=control!$C$10,data!E321<=control!$C$11))","v":false},{"$f":"IF($C345,data!D321,NA())","v":{"$error":"#N/A"}},{"$f":"IF($C345,data!E321,NA())","v":{"$error":"#N/A"}},{"$f":"IF($C345,data!F321,0)","v":0}]
[null,{"$f":"data!B322","v":"Herne"},{"$f":"CHOOSE(mySelectionType,\nSQRT((data!D322-control!$C$8)^2+(myAspectRatio*(data!E322-control!$C$9))^2)<=control!$C$17,\nAND(data!D322<=control!$C$8,data!E322>=control!$C$9,data!D322>=control!$C$10,data!E322<=control!$C$11))","v":false},{"$f":"IF($C346,data!D322,NA())","v":{"$error":"#N/A"}},{"$f":"IF($C346,data!E322,NA())","v":{"$error":"#N/A"}},{"$f":"IF($C346,data!F322,0)","v":0}]
[null,{"$f":"data!B323","v":"Olsztyn"},{"$f":"CHOOSE(mySelectionType,\nSQRT((data!D323-control!$C$8)^2+(myAspectRatio*(data!E323-control!$C$9))^2)<=control!$C$17,\nAND(data!D323<=control!$C$8,data!E323>=control!$C$9,data!D323>=control!$C$10,data!E323<=control!$C$11))","v":true},{"$f":"IF($C347,data!D323,NA())","v":53.779949999999999},{"$f":"IF($C347,data!E323,NA())","v":20.494160000000001},{"$f":"IF($C347,data!F323,0)","v":171803}]
[null,{"$f":"data!B324","v":"Prizren"},{"$f":"CHOOSE(mySelectionType,\nSQRT((data!D324-control!$C$8)^2+(myAspectRatio*(data!E324-control!$C$9))^2)<=control!$C$17,\nAND(data!D324<=control!$C$8,data!E324>=control!$C$9,data!D324>=control!$C$10,data!E324<=control!$C$11))","v":true},{"$f":"IF($C348,data!D324,NA())","v":42.213889999999999},{"$f":"IF($C348,data!E324,NA())","v":20.739719999999998},{"$f":"IF($C348,data!F324,0)","v":171464}]
[null,{"$f":"data!B325","v":"Bacău"},{"$f":"CHOOSE(mySelectionType,\nSQRT((data!D325-control!$C$8)^2+(myAspectRatio*(data!E325-control!$C$9))^2)<=control!$C$17,\nAND(data!D325<=control!$C$8,data!E325>=control!$C$9,data!D325>=control!$C$10,data!E325<=control!$C$11))","v":true},{"$f":"IF($C349,data!D325,NA())","v":46.566670000000002},{"$f":"IF($C349,data!E325,NA())","v":26.9},{"$f":"IF($C349,data!F325,0)","v":171396}]
[null,{"$f":"data!B326","v":"Mülheim (Ruhr)"},{"$f":"CHOOSE(mySelectionType,\nSQRT((data!D326-control!$C$8)^2+(myAspectRatio*(data!E326-control!$C$9))^2)<=control!$C$17,\nAND(data!D326<=control!$C$8,data!E326>=control!$C$9,data!D326>=control!$C$10,data!E326<=control!$C$11))","v":false},{"$f":"IF($C350,data!D326,NA())","v":{"$error":"#N/A"}},{"$f":"IF($C350,data!E326,NA())","v":{"$error":"#N/A"}},{"$f":"IF($C350,data!F326,0)","v":0}]
[null,{"$f":"data!B327","v":"Swansea"},{"$f":"CHOOSE(mySelectionType,\nSQRT((data!D327-control!$C$8)^2+(myAspectRatio*(data!E327-control!$C$9))^2)<=control!$C$17,\nAND(data!D327<=control!$C$8,data!E327>=control!$C$9,data!D327>=control!$C$10,data!E327<=control!$C$11))","v":false},{"$f":"IF($C351,data!D327,NA())","v":{"$error":"#N/A"}},{"$f":"IF($C351,data!E327,NA())","v":{"$error":"#N/A"}},{"$f":"IF($C351,data!F327,0)","v":0}]
[null,{"$f":"data!B328","v":"Albacete"},{"$f":"CHOOSE(mySelectionType,\nSQRT((data!D328-control!$C$8)^2+(myAspectRatio*(data!E328-control!$C$9))^2)<=control!$C$17,\nAND(data!D328<=control!$C$8,data!E328>=control!$C$9,data!D328>=control!$C$10,data!E328<=control!$C$11))","v":false},{"$f":"IF($C352,data!D328,NA())","v":{"$error":"#N/A"}},{"$f":"IF($C352,data!E328,NA())","v":{"$error":"#N/A"}},{"$f":"IF($C352,data!F328,0)","v":0}]
[null,{"$f":"data!B329","v":"Reggio Calabria"},{"$f":"CHOOSE(mySelectionType,\nSQRT((data!D329-control!$C$8)^2+(myAspectRatio*(data!E329-control!$C$9))^2)<=control!$C$17,\nAND(data!D329<=control!$C$8,data!E329>=control!$C$9,data!D329>=control!$C$10,data!E329<=control!$C$11))","v":false},{"$f":"IF($C353,data!D329,NA())","v":{"$error":"#N/A"}},{"$f":"IF($C353,data!E329,NA())","v":{"$error":"#N/A"}},{"$f":"IF($C353,data!F329,0)","v":0}]
[null,{"$f":"data!B330","v":"Arad"},{"$f":"CHOOSE(mySelectionType,\nSQRT((data!D330-control!$C$8)^2+(myAspectRatio*(data!E330-control!$C$9))^2)<=control!$C$17,\nAND(data!D330<=control!$C$8,data!E330>=control!$C$9,data!D330>=control!$C$10,data!E330<=control!$C$11))","v":true},{"$f":"IF($C354,data!D330,NA())","v":46.183329999999998},{"$f":"IF($C354,data!E330,NA())","v":21.316669999999998},{"$f":"IF($C354,data!F330,0)","v":169065}]
[null,{"$f":"data!B331","v":"Baranovichi"},{"$f":"CHOOSE(mySelectionType,\nSQRT((data!D331-control!$C$8)^2+(myAspectRatio*(data!E331-control!$C$9))^2)<=control!$C$17,\nAND(data!D331<=control!$C$8,data!E331>=control!$C$9,data!D331>=control!$C$10,data!E331<=control!$C$11))","v":true},{"$f":"IF($C355,data!D331,NA())","v":53.1327},{"$f":"IF($C355,data!E331,NA())","v":26.0139},{"$f":"IF($C355,data!F331,0)","v":168772}]
[null,{"$f":"data!B332","v":"Toulon"},{"$f":"CHOOSE(mySelectionType,\nSQRT((data!D332-control!$C$8)^2+(myAspectRatio*(data!E332-control!$C$9))^2)<=control!$C$17,\nAND(data!D332<=control!$C$8,data!E332>=control!$C$9,data!D332>=control!$C$10,data!E332<=control!$C$11))","v":false},{"$f":"IF($C356,data!D332,NA())","v":{"$error":"#N/A"}},{"$f":"IF($C356,data!E332,NA())","v":{"$error":"#N/A"}},{"$f":"IF($C356,data!F332,0)","v":0}]
[null,{"$f":"data!B333","v":"Angers"},{"$f":"CHOOSE(mySelectionType,\nSQRT((data!D333-control!$C$8)^2+(myAspectRatio*(data!E333-control!$C$9))^2)<=control!$C$17,\nAND(data!D333<=control!$C$8,data!E333>=control!$C$9,data!D333>=control!$C$10,data!E333<=control!$C$11))","v":false},{"$f":"IF($C357,data!D333,NA())","v":{"$error":"#N/A"}},{"$f":"IF($C357,data!E333,NA())","v":{"$error":"#N/A"}},{"$f":"IF($C357,data!F333,0)","v":0}]
[null,{"$f":"data!B334","v":"Alcorcón"},{"$f":"CHOOSE(mySelectionType,\nSQRT((data!D334-control!$C$8)^2+(myAspectRatio*(data!E334-control!$C$9))^2)<=control!$C$17,\nAND(data!D334<=control!$C$8,data!E334>=control!$C$9,data!D334>=control!$C$10,data!E334<=control!$C$11))","v":false},{"$f":"IF($C358,data!D334,NA())","v":{"$error":"#N/A"}},{"$f":"IF($C358,data!E334,NA())","v":{"$error":"#N/A"}},{"$f":"IF($C358,data!F334,0)","v":0}]
[null,{"$f":"data!B335","v":"Breda"},{"$f":"CHOOSE(mySelectionType,\nSQRT((data!D335-control!$C$8)^2+(myAspectRatio*(data!E335-control!$C$9))^2)<=control!$C$17,\nAND(data!D335<=control!$C$8,data!E335>=control!$C$9,data!D335>=control!$C$10,data!E335<=control!$C$11))","v":false},{"$f":"IF($C359,data!D335,NA())","v":{"$error":"#N/A"}},{"$f":"IF($C359,data!E335,NA())","v":{"$error":"#N/A"}},{"$f":"IF($C359,data!F335,0)","v":0}]
[null,{"$f":"data!B336","v":"Piteşti"},{"$f":"CHOOSE(mySelectionType,\nSQRT((data!D336-control!$C$8)^2+(myAspectRatio*(data!E336-control!$C$9))^2)<=control!$C$17,\nAND(data!D336<=control!$C$8,data!E336>=control!$C$9,data!D336>=control!$C$10,data!E336<=control!$C$11))","v":true},{"$f":"IF($C360,data!D336,NA())","v":44.85},{"$f":"IF($C360,data!E336,NA())","v":24.866669999999999},{"$f":"IF($C360,data!F336,0)","v":167669}]
[null,{"$f":"data!B337","v":"Getafe"},{"$f":"CHOOSE(mySelectionType,\nSQRT((data!D337-control!$C$8)^2+(myAspectRatio*(data!E337-control!$C$9))^2)<=control!$C$17,\nAND(data!D337<=control!$C$8,data!E337>=control!$C$9,data!D337>=control!$C$10,data!E337<=control!$C$11))","v":false},{"$f":"IF($C361,data!D337,NA())","v":{"$error":"#N/A"}},{"$f":"IF($C361,data!E337,NA())","v":{"$error":"#N/A"}},{"$f":"IF($C361,data!F337,0)","v":0}]
[null,{"$f":"data!B338","v":"Osnabrück"},{"$f":"CHOOSE(mySelectionType,\nSQRT((data!D338-control!$C$8)^2+(myAspectRatio*(data!E338-control!$C$9))^2)<=control!$C$17,\nAND(data!D338<=control!$C$8,data!E338>=control!$C$9,data!D338>=control!$C$10,data!E338<=control!$C$11))","v":false},{"$f":"IF($C362,data!D338,NA())","v":{"$error":"#N/A"}},{"$f":"IF($C362,data!E338,NA())","v":{"$error":"#N/A"}},{"$f":"IF($C362,data!F338,0)","v":0}]
[null,{"$f":"data!B339","v":"Szeged"},{"$f":"CHOOSE(mySelectionType,\nSQRT((data!D339-control!$C$8)^2+(myAspectRatio*(data!E339-control!$C$9))^2)<=control!$C$17,\nAND(data!D339<=control!$C$8,data!E339>=control!$C$9,data!D339>=control!$C$10,data!E339<=control!$C$11))","v":true},{"$f":"IF($C363,data!D339,NA())","v":46.253},{"$f":"IF($C363,data!E339,NA())","v":20.148240000000001},{"$f":"IF($C363,data!F339,0)","v":164883}]
[null,{"$f":"data!B340","v":"Basel"},{"$f":"CHOOSE(mySelectionType,\nSQRT((data!D340-control!$C$8)^2+(myAspectRatio*(data!E340-control!$C$9))^2)<=control!$C$17,\nAND(data!D340<=control!$C$8,data!E340>=control!$C$9,data!D340>=control!$C$10,data!E340<=control!$C$11))","v":false},{"$f":"IF($C364,data!D340,NA())","v":{"$error":"#N/A"}},{"$f":"IF($C364,data!E340,NA())","v":{"$error":"#N/A"}},{"$f":"IF($C364,data!F340,0)","v":0}]
[null,{"$f":"data!B341","v":"Zenica"},{"$f":"CHOOSE(mySelectionType,\nSQRT((data!D341-control!$C$8)^2+(myAspectRatio*(data!E341-control!$C$9))^2)<=control!$C$17,\nAND(data!D341<=control!$C$8,data!E341>=control!$C$9,data!D341>=control!$C$10,data!E341<=control!$C$11))","v":true},{"$f":"IF($C365,data!D341,NA())","v":44.201689999999999},{"$f":"IF($C365,data!E341,NA())","v":17.903970000000001},{"$f":"IF($C365,data!F341,0)","v":164423}]
[null,{"$f":"data!B342","v":"Solingen"},{"$f":"CHOOSE(mySelectionType,\nSQRT((data!D342-control!$C$8)^2+(myAspectRatio*(data!E342-control!$C$9))^2)<=control!$C$17,\nAND(data!D342<=control!$C$8,data!E342>=control!$C$9,data!D342>=control!$C$10,data!E342<=control!$C$11))","v":false},{"$f":"IF($C366,data!D342,NA())","v":{"$error":"#N/A"}},{"$f":"IF($C366,data!E342,NA())","v":{"$error":"#N/A"}},{"$f":"IF($C366,data!F342,0)","v":0}]
[null,{"$f":"data!B343","v":"Pilsen"},{"$f":"CHOOSE(mySelectionType,\nSQRT((data!D343-control!$C$8)^2+(myAspectRatio*(data!E343-control!$C$9))^2)<=control!$C$17,\nAND(data!D343<=control!$C$8,data!E343>=control!$C$9,data!D343>=control!$C$10,data!E343<=control!$C$11))","v":true},{"$f":"IF($C367,data!D343,NA())","v":49.74747},{"$f":"IF($C367,data!E343,NA())","v":13.37759},{"$f":"IF($C367,data!F343,0)","v":164180}]
[null,{"$f":"data!B344","v":"Piraeus"},{"$f":"CHOOSE(mySelectionType,\nSQRT((data!D344-control!$C$8)^2+(myAspectRatio*(data!E344-control!$C$9))^2)<=control!$C$17,\nAND(data!D344<=control!$C$8,data!E344>=control!$C$9,data!D344>=control!$C$10,data!E344<=control!$C$11))","v":true},{"$f":"IF($C368,data!D344,NA())","v":37.947450000000003},{"$f":"IF($C368,data!E344,NA())","v":23.637080000000001},{"$f":"IF($C368,data!F344,0)","v":163688}]
[null,{"$f":"data!B345","v":"Bournemouth"},{"$f":"CHOOSE(mySelectionType,\nSQRT((data!D345-control!$C$8)^2+(myAspectRatio*(data!E345-control!$C$9))^2)<=control!$C$17,\nAND(data!D345<=control!$C$8,data!E345>=control!$C$9,data!D345>=control!$C$10,data!E345<=control!$C$11))","v":false},{"$f":"IF($C369,data!D345,NA())","v":{"$error":"#N/A"}},{"$f":"IF($C369,data!E345,NA())","v":{"$error":"#N/A"}},{"$f":"IF($C369,data!F345,0)","v":0}]
[null,{"$f":"data!B346","v":"Southend-on-Sea"},{"$f":"CHOOSE(mySelectionType,\nSQRT((data!D346-control!$C$8)^2+(myAspectRatio*(data!E346-control!$C$9))^2)<=control!$C$17,\nAND(data!D346<=control!$C$8,data!E346>=control!$C$9,data!D346>=control!$C$10,data!E346<=control!$C$11))","v":false},{"$f":"IF($C370,data!D346,NA())","v":{"$error":"#N/A"}},{"$f":"IF($C370,data!E346,NA())","v":{"$error":"#N/A"}},{"$f":"IF($C370,data!F346,0)","v":0}]
[null,{"$f":"data!B347","v":"Pátra"},{"$f":"CHOOSE(mySelectionType,\nSQRT((data!D347-control!$C$8)^2+(myAspectRatio*(data!E347-control!$C$9))^2)<=control!$C$17,\nAND(data!D347<=control!$C$8,data!E347>=control!$C$9,data!D347>=control!$C$10,data!E347<=control!$C$11))","v":true},{"$f":"IF($C371,data!D347,NA())","v":38.244439999999997},{"$f":"IF($C371,data!E347,NA())","v":21.734439999999999},{"$f":"IF($C371,data!F347,0)","v":163360}]
[null,{"$f":"data!B348","v":"Ludwigshafen am Rhein"},{"$f":"CHOOSE(mySelectionType,\nSQRT((data!D348-control!$C$8)^2+(myAspectRatio*(data!E348-control!$C$9))^2)<=control!$C$17,\nAND(data!D348<=control!$C$8,data!E348>=control!$C$9,data!D348>=control!$C$10,data!E348<=control!$C$11))","v":true},{"$f":"IF($C372,data!D348,NA())","v":49.481209999999997},{"$f":"IF($C372,data!E348,NA())","v":8.4464100000000002},{"$f":"IF($C372,data!F348,0)","v":163196}]
[null,{"$f":"data!B349","v":"Aydın"},{"$f":"CHOOSE(mySelectionType,\nSQRT((data!D349-control!$C$8)^2+(myAspectRatio*(data!E349-control!$C$9))^2)<=control!$C$17,\nAND(data!D349<=control!$C$8,data!E349>=control!$C$9,data!D349>=control!$C$10,data!E349<=control!$C$11))","v":false},{"$f":"IF($C373,data!D349,NA())","v":{"$error":"#N/A"}},{"$f":"IF($C373,data!E349,NA())","v":{"$error":"#N/A"}},{"$f":"IF($C373,data!F349,0)","v":0}]
[null,{"$f":"data!B350","v":"Leverkusen"},{"$f":"CHOOSE(mySelectionType,\nSQRT((data!D350-control!$C$8)^2+(myAspectRatio*(data!E350-control!$C$9))^2)<=control!$C$17,\nAND(data!D350<=control!$C$8,data!E350>=control!$C$9,data!D350>=control!$C$10,data!E350<=control!$C$11))","v":false},{"$f":"IF($C374,data!D350,NA())","v":{"$error":"#N/A"}},{"$f":"IF($C374,data!E350,NA())","v":{"$error":"#N/A"}},{"$f":"IF($C374,data!F350,0)","v":0}]
[null,{"$f":"data!B351","v":"İskenderun"},{"$f":"CHOOSE(mySelectionType,\nSQRT((data!D351-control!$C$8)^2+(myAspectRatio*(data!E351-control!$C$9))^2)<=control!$C$17,\nAND(data!D351<=control!$C$8,data!E351>=control!$C$9,data!D351>=control!$C$10,data!E351<=control!$C$11))","v":false},{"$f":"IF($C375,data!D351,NA())","v":{"$error":"#N/A"}},{"$f":"IF($C375,data!E351,NA())","v":{"$error":"#N/A"}},{"$f":"IF($C375,data!F351,0)","v":0}]
[null,{"$f":"data!B352","v":"Oldenburg"},{"$f":"CHOOSE(mySelectionType,\nSQRT((data!D352-control!$C$8)^2+(myAspectRatio*(data!E352-control!$C$9))^2)<=control!$C$17,\nAND(data!D352<=control!$C$8,data!E352>=control!$C$9,data!D352>=control!$C$10,data!E352<=control!$C$11))","v":false},{"$f":"IF($C376,data!D352,NA())","v":{"$error":"#N/A"}},{"$f":"IF($C376,data!E352,NA())","v":{"$error":"#N/A"}},{"$f":"IF($C376,data!F352,0)","v":0}]
[null,{"$f":"data!B353","v":"Modena"},{"$f":"CHOOSE(mySelectionType,\nSQRT((data!D353-control!$C$8)^2+(myAspectRatio*(data!E353-control!$C$9))^2)<=control!$C$17,\nAND(data!D353<=control!$C$8,data!E353>=control!$C$9,data!D353>=control!$C$10,data!E353<=control!$C$11))","v":true},{"$f":"IF($C377,data!D353,NA())","v":44.647829999999999},{"$f":"IF($C377,data!E353,NA())","v":10.92539},{"$f":"IF($C377,data!F353,0)","v":158886}]
[null,{"$f":"data!B354","v":"Nijmegen"},{"$f":"CHOOSE(mySelectionType,\nSQRT((data!D354-control!$C$8)^2+(myAspectRatio*(data!E354-control!$C$9))^2)<=control!$C$17,\nAND(data!D354<=control!$C$8,data!E354>=control!$C$9,data!D354>=control!$C$10,data!E354<=control!$C$11))","v":false},{"$f":"IF($C378,data!D354,NA())","v":{"$error":"#N/A"}},{"$f":"IF($C378,data!E354,NA())","v":{"$error":"#N/A"}},{"$f":"IF($C378,data!F354,0)","v":0}]
[null,{"$f":"data!B355","v":"Grenoble"},{"$f":"CHOOSE(mySelectionType,\nSQRT((data!D355-control!$C$8)^2+(myAspectRatio*(data!E355-control!$C$9))^2)<=control!$C$17,\nAND(data!D355<=control!$C$8,data!E355>=control!$C$9,data!D355>=control!$C$10,data!E355<=control!$C$11))","v":false},{"$f":"IF($C379,data!D355,NA())","v":{"$error":"#N/A"}},{"$f":"IF($C379,data!E355,NA())","v":{"$error":"#N/A"}},{"$f":"IF($C379,data!F355,0)","v":0}]
[null,{"$f":"data!B356","v":"Rzeszów"},{"$f":"CHOOSE(mySelectionType,\nSQRT((data!D356-control!$C$8)^2+(myAspectRatio*(data!E356-control!$C$9))^2)<=control!$C$17,\nAND(data!D356<=control!$C$8,data!E356>=control!$C$9,data!D356>=control!$C$10,data!E356<=control!$C$11))","v":true},{"$f":"IF($C380,data!D356,NA())","v":50.041319999999999},{"$f":"IF($C380,data!E356,NA())","v":21.999009999999998},{"$f":"IF($C380,data!F356,0)","v":158382}]
[null,{"$f":"data!B357","v":"Melitopol’"},{"$f":"CHOOSE(mySelectionType,\nSQRT((data!D357-control!$C$8)^2+(myAspectRatio*(data!E357-control!$C$9))^2)<=control!$C$17,\nAND(data!D357<=control!$C$8,data!E357>=control!$C$9,data!D357>=control!$C$10,data!E357<=control!$C$11))","v":false},{"$f":"IF($C381,data!D357,NA())","v":{"$error":"#N/A"}},{"$f":"IF($C381,data!E357,NA())","v":{"$error":"#N/A"}},{"$f":"IF($C381,data!F357,0)","v":0}]
[null,{"$f":"data!B358","v":"Tiraspol"},{"$f":"CHOOSE(mySelectionType,\nSQRT((data!D358-control!$C$8)^2+(myAspectRatio*(data!E358-control!$C$9))^2)<=control!$C$17,\nAND(data!D358<=control!$C$8,data!E358>=control!$C$9,data!D358>=control!$C$10,data!E358<=control!$C$11))","v":true},{"$f":"IF($C382,data!D358,NA())","v":46.84028},{"$f":"IF($C382,data!E358,NA())","v":29.643329999999999},{"$f":"IF($C382,data!F358,0)","v":157000}]
[null,{"$f":"data!B359","v":"Pécs"},{"$f":"CHOOSE(mySelectionType,\nSQRT((data!D359-control!$C$8)^2+(myAspectRatio*(data!E359-control!$C$9))^2)<=control!$C$17,\nAND(data!D359<=control!$C$8,data!E359>=control!$C$9,data!D359>=control!$C$10,data!E359<=control!$C$11))","v":true},{"$f":"IF($C383,data!D359,NA())","v":46.083329999999997},{"$f":"IF($C383,data!E359,NA())","v":18.233329999999999},{"$f":"IF($C383,data!F359,0)","v":156649}]
[null,{"$f":"data!B360","v":"Ruse"},{"$f":"CHOOSE(mySelectionType,\nSQRT((data!D360-control!$C$8)^2+(myAspectRatio*(data!E360-control!$C$9))^2)<=control!$C$17,\nAND(data!D360<=control!$C$8,data!E360>=control!$C$9,data!D360>=control!$C$10,data!E360<=control!$C$11))","v":true},{"$f":"IF($C384,data!D360,NA())","v":43.856389999999998},{"$f":"IF($C384,data!E360,NA())","v":25.970829999999999},{"$f":"IF($C384,data!F360,0)","v":156238}]
[null,{"$f":"data!B361","v":"Salamanca"},{"$f":"CHOOSE(mySelectionType,\nSQRT((data!D361-control!$C$8)^2+(myAspectRatio*(data!E361-control!$C$9))^2)<=control!$C$17,\nAND(data!D361<=control!$C$8,data!E361>=control!$C$9,data!D361>=control!$C$10,data!E361<=control!$C$11))","v":false},{"$f":"IF($C385,data!D361,NA())","v":{"$error":"#N/A"}},{"$f":"IF($C385,data!E361,NA())","v":{"$error":"#N/A"}},{"$f":"IF($C385,data!F361,0)","v":0}]
[null,{"$f":"data!B362","v":"Swindon"},{"$f":"CHOOSE(mySelectionType,\nSQRT((data!D362-control!$C$8)^2+(myAspectRatio*(data!E362-control!$C$9))^2)<=control!$C$17,\nAND(data!D362<=control!$C$8,data!E362>=control!$C$9,data!D362>=control!$C$10,data!E362<=control!$C$11))","v":false},{"$f":"IF($C386,data!D362,NA())","v":{"$error":"#N/A"}},{"$f":"IF($C386,data!E362,NA())","v":{"$error":"#N/A"}},{"$f":"IF($C386,data!F362,0)","v":0}]
[null,{"$f":"data!B363","v":"Oxford"},{"$f":"CHOOSE(mySelectionType,\nSQRT((data!D363-control!$C$8)^2+(myAspectRatio*(data!E363-control!$C$9))^2)<=control!$C$17,\nAND(data!D363<=control!$C$8,data!E363>=control!$C$9,data!D363>=control!$C$10,data!E363<=control!$C$11))","v":false},{"$f":"IF($C387,data!D363,NA())","v":{"$error":"#N/A"}},{"$f":"IF($C387,data!E363,NA())","v":{"$error":"#N/A"}},{"$f":"IF($C387,data!F363,0)","v":0}]
[null,{"$f":"data!B364","v":"Viranşehir"},{"$f":"CHOOSE(mySelectionType,\nSQRT((data!D364-control!$C$8)^2+(myAspectRatio*(data!E364-control!$C$9))^2)<=control!$C$17,\nAND(data!D364<=control!$C$8,data!E364>=control!$C$9,data!D364>=control!$C$10,data!E364<=control!$C$11))","v":false},{"$f":"IF($C388,data!D364,NA())","v":{"$error":"#N/A"}},{"$f":"IF($C388,data!E364,NA())","v":{"$error":"#N/A"}},{"$f":"IF($C388,data!F364,0)","v":0}]
[null,{"$f":"data!B365","v":"Livorno"},{"$f":"CHOOSE(mySelectionType,\nSQRT((data!D365-control!$C$8)^2+(myAspectRatio*(data!E365-control!$C$9))^2)<=control!$C$17,\nAND(data!D365<=control!$C$8,data!E365>=control!$C$9,data!D365>=control!$C$10,data!E365<=control!$C$11))","v":true},{"$f":"IF($C389,data!D365,NA())","v":43.544269999999997},{"$f":"IF($C389,data!E365,NA())","v":10.32615},{"$f":"IF($C389,data!F365,0)","v":153773}]
[null,{"$f":"data!B366","v":"Enschede"},{"$f":"CHOOSE(mySelectionType,\nSQRT((data!D366-control!$C$8)^2+(myAspectRatio*(data!E366-control!$C$9))^2)<=control!$C$17,\nAND(data!D366<=control!$C$8,data!E366>=control!$C$9,data!D366>=control!$C$10,data!E366<=control!$C$11))","v":false},{"$f":"IF($C390,data!D366,NA())","v":{"$error":"#N/A"}},{"$f":"IF($C390,data!E366,NA())","v":{"$error":"#N/A"}},{"$f":"IF($C390,data!F366,0)","v":0}]
[null,{"$f":"data!B367","v":"Uşak"},{"$f":"CHOOSE(mySelectionType,\nSQRT((data!D367-control!$C$8)^2+(myAspectRatio*(data!E367-control!$C$9))^2)<=control!$C$17,\nAND(data!D367<=control!$C$8,data!E367>=control!$C$9,data!D367>=control!$C$10,data!E367<=control!$C$11))","v":false},{"$f":"IF($C391,data!D367,NA())","v":{"$error":"#N/A"}},{"$f":"IF($C391,data!E367,NA())","v":{"$error":"#N/A"}},{"$f":"IF($C391,data!F367,0)","v":0}]
[null,{"$f":"data!B368","v":"Neuss"},{"$f":"CHOOSE(mySelectionType,\nSQRT((data!D368-control!$C$8)^2+(myAspectRatio*(data!E368-control!$C$9))^2)<=control!$C$17,\nAND(data!D368<=control!$C$8,data!E368>=control!$C$9,data!D368>=control!$C$10,data!E368<=control!$C$11))","v":false},{"$f":"IF($C392,data!D368,NA())","v":{"$error":"#N/A"}},{"$f":"IF($C392,data!E368,NA())","v":{"$error":"#N/A"}},{"$f":"IF($C392,data!F368,0)","v":0}]
[null,{"$f":"data!B369","v":"Aksaray"},{"$f":"CHOOSE(mySelectionType,\nSQRT((data!D369-control!$C$8)^2+(myAspectRatio*(data!E369-control!$C$9))^2)<=control!$C$17,\nAND(data!D369<=control!$C$8,data!E369>=control!$C$9,data!D369>=control!$C$10,data!E369<=control!$C$11))","v":false},{"$f":"IF($C393,data!D369,NA())","v":{"$error":"#N/A"}},{"$f":"IF($C393,data!E369,NA())","v":{"$error":"#N/A"}},{"$f":"IF($C393,data!F369,0)","v":0}]
[null,{"$f":"data!B370","v":"Kerch"},{"$f":"CHOOSE(mySelectionType,\nSQRT((data!D370-control!$C$8)^2+(myAspectRatio*(data!E370-control!$C$9))^2)<=control!$C$17,\nAND(data!D370<=control!$C$8,data!E370>=control!$C$9,data!D370>=control!$C$10,data!E370<=control!$C$11))","v":false},{"$f":"IF($C394,data!D370,NA())","v":{"$error":"#N/A"}},{"$f":"IF($C394,data!E370,NA())","v":{"$error":"#N/A"}},{"$f":"IF($C394,data!F370,0)","v":0}]
[null,{"$f":"data!B371","v":"Logroño"},{"$f":"CHOOSE(mySelectionType,\nSQRT((data!D371-control!$C$8)^2+(myAspectRatio*(data!E371-control!$C$9))^2)<=control!$C$17,\nAND(data!D371<=control!$C$8,data!E371>=control!$C$9,data!D371>=control!$C$10,data!E371<=control!$C$11))","v":false},{"$f":"IF($C395,data!D371,NA())","v":{"$error":"#N/A"}},{"$f":"IF($C395,data!E371,NA())","v":{"$error":"#N/A"}},{"$f":"IF($C395,data!F371,0)","v":0}]
[null,{"$f":"data!B372","v":"Sibiu"},{"$f":"CHOOSE(mySelectionType,\nSQRT((data!D372-control!$C$8)^2+(myAspectRatio*(data!E372-control!$C$9))^2)<=control!$C$17,\nAND(data!D372<=control!$C$8,data!E372>=control!$C$9,data!D372>=control!$C$10,data!E372<=control!$C$11))","v":true},{"$f":"IF($C396,data!D372,NA())","v":45.8},{"$f":"IF($C396,data!E372,NA())","v":24.15},{"$f":"IF($C396,data!F372,0)","v":151894}]
[null,{"$f":"data!B373","v":"Dundee"},{"$f":"CHOOSE(mySelectionType,\nSQRT((data!D373-control!$C$8)^2+(myAspectRatio*(data!E373-control!$C$9))^2)<=control!$C$17,\nAND(data!D373<=control!$C$8,data!E373>=control!$C$9,data!D373>=control!$C$10,data!E373<=control!$C$11))","v":false},{"$f":"IF($C397,data!D373,NA())","v":{"$error":"#N/A"}},{"$f":"IF($C397,data!E373,NA())","v":{"$error":"#N/A"}},{"$f":"IF($C397,data!F373,0)","v":0}]
[null,{"$f":"data!B374","v":"Salzburg"},{"$f":"CHOOSE(mySelectionType,\nSQRT((data!D374-control!$C$8)^2+(myAspectRatio*(data!E374-control!$C$9))^2)<=control!$C$17,\nAND(data!D374<=control!$C$8,data!E374>=control!$C$9,data!D374>=control!$C$10,data!E374<=control!$C$11))","v":true},{"$f":"IF($C398,data!D374,NA())","v":47.799410000000002},{"$f":"IF($C398,data!E374,NA())","v":13.043990000000001},{"$f":"IF($C398,data!F374,0)","v":150269}]
[null,{"$f":"data!B375","v":"Poole"},{"$f":"CHOOSE(mySelectionType,\nSQRT((data!D375-control!$C$8)^2+(myAspectRatio*(data!E375-control!$C$9))^2)<=control!$C$17,\nAND(data!D375<=control!$C$8,data!E375>=control!$C$9,data!D375>=control!$C$10,data!E375<=control!$C$11))","v":false},{"$f":"IF($C399,data!D375,NA())","v":{"$error":"#N/A"}},{"$f":"IF($C399,data!E375,NA())","v":{"$error":"#N/A"}},{"$f":"IF($C399,data!F375,0)","v":0}]
[null,{"$f":"data!B376","v":"Dijon"},{"$f":"CHOOSE(mySelectionType,\nSQRT((data!D376-control!$C$8)^2+(myAspectRatio*(data!E376-control!$C$9))^2)<=control!$C$17,\nAND(data!D376<=control!$C$8,data!E376>=control!$C$9,data!D376>=control!$C$10,data!E376<=control!$C$11))","v":false},{"$f":"IF($C400,data!D376,NA())","v":{"$error":"#N/A"}},{"$f":"IF($C400,data!E376,NA())","v":{"$error":"#N/A"}},{"$f":"IF($C400,data!F376,0)","v":0}]
[null,{"$f":"data!B377","v":"Cagliari"},{"$f":"CHOOSE(mySelectionType,\nSQRT((data!D377-control!$C$8)^2+(myAspectRatio*(data!E377-control!$C$9))^2)<=control!$C$17,\nAND(data!D377<=control!$C$8,data!E377>=control!$C$9,data!D377>=control!$C$10,data!E377<=control!$C$11))","v":false},{"$f":"IF($C401,data!D377,NA())","v":{"$error":"#N/A"}},{"$f":"IF($C401,data!E377,NA())","v":{"$error":"#N/A"}},{"$f":"IF($C401,data!F377,0)","v":0}]
[null,{"$f":"data!B378","v":"Huddersfield"},{"$f":"CHOOSE(mySelectionType,\nSQRT((data!D378-control!$C$8)^2+(myAspectRatio*(data!E378-control!$C$9))^2)<=control!$C$17,\nAND(data!D378<=control!$C$8,data!E378>=control!$C$9,data!D378>=control!$C$10,data!E378<=control!$C$11))","v":false},{"$f":"IF($C402,data!D378,NA())","v":{"$error":"#N/A"}},{"$f":"IF($C402,data!E378,NA())","v":{"$error":"#N/A"}},{"$f":"IF($C402,data!F378,0)","v":0}]
[null,{"$f":"data!B379","v":"Huelva"},{"$f":"CHOOSE(mySelectionType,\nSQRT((data!D379-control!$C$8)^2+(myAspectRatio*(data!E379-control!$C$9))^2)<=control!$C$17,\nAND(data!D379<=control!$C$8,data!E379>=control!$C$9,data!D379>=control!$C$10,data!E379<=control!$C$11))","v":false},{"$f":"IF($C403,data!D379,NA())","v":{"$error":"#N/A"}},{"$f":"IF($C403,data!E379,NA())","v":{"$error":"#N/A"}},{"$f":"IF($C403,data!F379,0)","v":0}]
[null,{"$f":"data!B380","v":"Badajoz"},{"$f":"CHOOSE(mySelectionType,\nSQRT((data!D380-control!$C$8)^2+(myAspectRatio*(data!E380-control!$C$9))^2)<=control!$C$17,\nAND(data!D380<=control!$C$8,data!E380>=control!$C$9,data!D380>=control!$C$10,data!E380<=control!$C$11))","v":false},{"$f":"IF($C404,data!D380,NA())","v":{"$error":"#N/A"}},{"$f":"IF($C404,data!E380,NA())","v":{"$error":"#N/A"}},{"$f":"IF($C404,data!F380,0)","v":0}]
[null,{"$f":"data!B381","v":"Nîmes"},{"$f":"CHOOSE(mySelectionType,\nSQRT((data!D381-control!$C$8)^2+(myAspectRatio*(data!E381-control!$C$9))^2)<=control!$C$17,\nAND(data!D381<=control!$C$8,data!E381>=control!$C$9,data!D381>=control!$C$10,data!E381<=control!$C$11))","v":false},{"$f":"IF($C405,data!D381,NA())","v":{"$error":"#N/A"}},{"$f":"IF($C405,data!E381,NA())","v":{"$error":"#N/A"}},{"$f":"IF($C405,data!F381,0)","v":0}]
[null,{"$f":"data!B382","v":"Mestre"},{"$f":"CHOOSE(mySelectionType,\nSQRT((data!D382-control!$C$8)^2+(myAspectRatio*(data!E382-control!$C$9))^2)<=control!$C$17,\nAND(data!D382<=control!$C$8,data!E382>=control!$C$9,data!D382>=control!$C$10,data!E382<=control!$C$11))","v":true},{"$f":"IF($C406,data!D382,NA())","v":45.471519999999998},{"$f":"IF($C406,data!E382,NA())","v":12.240170000000001},{"$f":"IF($C406,data!F382,0)","v":147662}]
[null,{"$f":"data!B383","v":"Haarlem"},{"$f":"CHOOSE(mySelectionType,\nSQRT((data!D383-control!$C$8)^2+(myAspectRatio*(data!E383-control!$C$9))^2)<=control!$C$17,\nAND(data!D383<=control!$C$8,data!E383>=control!$C$9,data!D383>=control!$C$10,data!E383<=control!$C$11))","v":false},{"$f":"IF($C407,data!D383,NA())","v":{"$error":"#N/A"}},{"$f":"IF($C407,data!E383,NA())","v":{"$error":"#N/A"}},{"$f":"IF($C407,data!F383,0)","v":0}]
[null,{"$f":"data!B384","v":"Kragujevac"},{"$f":"CHOOSE(mySelectionType,\nSQRT((data!D384-control!$C$8)^2+(myAspectRatio*(data!E384-control!$C$9))^2)<=control!$C$17,\nAND(data!D384<=control!$C$8,data!E384>=control!$C$9,data!D384>=control!$C$10,data!E384<=control!$C$11))","v":true},{"$f":"IF($C408,data!D384,NA())","v":44.016669999999998},{"$f":"IF($C408,data!E384,NA())","v":20.91667},{"$f":"IF($C408,data!F384,0)","v":147473}]
[null,{"$f":"data!B385","v":"Trondheim"},{"$f":"CHOOSE(mySelectionType,\nSQRT((data!D385-control!$C$8)^2+(myAspectRatio*(data!E385-control!$C$9))^2)<=control!$C$17,\nAND(data!D385<=control!$C$8,data!E385>=control!$C$9,data!D385>=control!$C$10,data!E385<=control!$C$11))","v":false},{"$f":"IF($C409,data!D385,NA())","v":{"$error":"#N/A"}},{"$f":"IF($C409,data!E385,NA())","v":{"$error":"#N/A"}},{"$f":"IF($C409,data!F385,0)","v":0}]
[null,{"$f":"data!B386","v":"Târgu-Mureş"},{"$f":"CHOOSE(mySelectionType,\nSQRT((data!D386-control!$C$8)^2+(myAspectRatio*(data!E386-control!$C$9))^2)<=control!$C$17,\nAND(data!D386<=control!$C$8,data!E386>=control!$C$9,data!D386>=control!$C$10,data!E386<=control!$C$11))","v":true},{"$f":"IF($C410,data!D386,NA())","v":46.542450000000002},{"$f":"IF($C410,data!E386,NA())","v":24.557469999999999},{"$f":"IF($C410,data!F386,0)","v":146863}]
[null,{"$f":"data!B387","v":"Aix-en-Provence"},{"$f":"CHOOSE(mySelectionType,\nSQRT((data!D387-control!$C$8)^2+(myAspectRatio*(data!E387-control!$C$9))^2)<=control!$C$17,\nAND(data!D387<=control!$C$8,data!E387>=control!$C$9,data!D387>=control!$C$10,data!E387<=control!$C$11))","v":false},{"$f":"IF($C411,data!D387,NA())","v":{"$error":"#N/A"}},{"$f":"IF($C411,data!E387,NA())","v":{"$error":"#N/A"}},{"$f":"IF($C411,data!F387,0)","v":0}]
[null,{"$f":"data!B388","v":"Saint-Quentin-en-Yvelines"},{"$f":"CHOOSE(mySelectionType,\nSQRT((data!D388-control!$C$8)^2+(myAspectRatio*(data!E388-control!$C$9))^2)<=control!$C$17,\nAND(data!D388<=control!$C$8,data!E388>=control!$C$9,data!D388>=control!$C$10,data!E388<=control!$C$11))","v":false},{"$f":"IF($C412,data!D388,NA())","v":{"$error":"#N/A"}},{"$f":"IF($C412,data!E388,NA())","v":{"$error":"#N/A"}},{"$f":"IF($C412,data!F388,0)","v":0}]
[null,{"$f":"data!B389","v":"Parma"},{"$f":"CHOOSE(mySelectionType,\nSQRT((data!D389-control!$C$8)^2+(myAspectRatio*(data!E389-control!$C$9))^2)<=control!$C$17,\nAND(data!D389<=control!$C$8,data!E389>=control!$C$9,data!D389>=control!$C$10,data!E389<=control!$C$11))","v":true},{"$f":"IF($C413,data!D389,NA())","v":44.799349999999997},{"$f":"IF($C413,data!E389,NA())","v":10.326180000000001},{"$f":"IF($C413,data!F389,0)","v":146299}]
[null,{"$f":"data!B390","v":"Ruda Śląska"},{"$f":"CHOOSE(mySelectionType,\nSQRT((data!D390-control!$C$8)^2+(myAspectRatio*(data!E390-control!$C$9))^2)<=control!$C$17,\nAND(data!D390<=control!$C$8,data!E390>=control!$C$9,data!D390>=control!$C$10,data!E390<=control!$C$11))","v":true},{"$f":"IF($C414,data!D390,NA())","v":50.258400000000002},{"$f":"IF($C414,data!E390,NA())","v":18.85632},{"$f":"IF($C414,data!F390,0)","v":146189}]
[null,{"$f":"data!B391","v":"Afyonkarahisar"},{"$f":"CHOOSE(mySelectionType,\nSQRT((data!D391-control!$C$8)^2+(myAspectRatio*(data!E391-control!$C$9))^2)<=control!$C$17,\nAND(data!D391<=control!$C$8,data!E391>=control!$C$9,data!D391>=control!$C$10,data!E391<=control!$C$11))","v":false},{"$f":"IF($C415,data!D391,NA())","v":{"$error":"#N/A"}},{"$f":"IF($C415,data!E391,NA())","v":{"$error":"#N/A"}},{"$f":"IF($C415,data!F391,0)","v":0}]
[null,{"$f":"data!B392","v":"Odense"},{"$f":"CHOOSE(mySelectionType,\nSQRT((data!D392-control!$C$8)^2+(myAspectRatio*(data!E392-control!$C$9))^2)<=control!$C$17,\nAND(data!D392<=control!$C$8,data!E392>=control!$C$9,data!D392>=control!$C$10,data!E392<=control!$C$11))","v":true},{"$f":"IF($C416,data!D392,NA())","v":55.395940000000003},{"$f":"IF($C416,data!E392,NA())","v":10.388310000000001},{"$f":"IF($C416,data!F392,0)","v":145931}]
[null,{"$f":"data!B393","v":"Potsdam"},{"$f":"CHOOSE(mySelectionType,\nSQRT((data!D393-control!$C$8)^2+(myAspectRatio*(data!E393-control!$C$9))^2)<=control!$C$17,\nAND(data!D393<=control!$C$8,data!E393>=control!$C$9,data!D393>=control!$C$10,data!E393<=control!$C$11))","v":true},{"$f":"IF($C417,data!D393,NA())","v":52.398859999999999},{"$f":"IF($C417,data!E393,NA())","v":13.065659999999999},{"$f":"IF($C417,data!F393,0)","v":145292}]
[null,{"$f":"data!B394","v":"Brest"},{"$f":"CHOOSE(mySelectionType,\nSQRT((data!D394-control!$C$8)^2+(myAspectRatio*(data!E394-control!$C$9))^2)<=control!$C$17,\nAND(data!D394<=control!$C$8,data!E394>=control!$C$9,data!D394>=control!$C$10,data!E394<=control!$C$11))","v":false},{"$f":"IF($C418,data!D394,NA())","v":{"$error":"#N/A"}},{"$f":"IF($C418,data!E394,NA())","v":{"$error":"#N/A"}},{"$f":"IF($C418,data!F394,0)","v":0}]
[null,{"$f":"data!B395","v":"Le Mans"},{"$f":"CHOOSE(mySelectionType,\nSQRT((data!D395-control!$C$8)^2+(myAspectRatio*(data!E395-control!$C$9))^2)<=control!$C$17,\nAND(data!D395<=control!$C$8,data!E395>=control!$C$9,data!D395>=control!$C$10,data!E395<=control!$C$11))","v":false},{"$f":"IF($C419,data!D395,NA())","v":{"$error":"#N/A"}},{"$f":"IF($C419,data!E395,NA())","v":{"$error":"#N/A"}},{"$f":"IF($C419,data!F395,0)","v":0}]
[null,{"$f":"data!B396","v":"York"},{"$f":"CHOOSE(mySelectionType,\nSQRT((data!D396-control!$C$8)^2+(myAspectRatio*(data!E396-control!$C$9))^2)<=control!$C$17,\nAND(data!D396<=control!$C$8,data!E396>=control!$C$9,data!D396>=control!$C$10,data!E396<=control!$C$11))","v":false},{"$f":"IF($C420,data!D396,NA())","v":{"$error":"#N/A"}},{"$f":"IF($C420,data!E396,NA())","v":{"$error":"#N/A"}},{"$f":"IF($C420,data!F396,0)","v":0}]
[null,{"$f":"data!B397","v":"Ipswich"},{"$f":"CHOOSE(mySelectionType,\nSQRT((data!D397-control!$C$8)^2+(myAspectRatio*(data!E397-control!$C$9))^2)<=control!$C$17,\nAND(data!D397<=control!$C$8,data!E397>=control!$C$9,data!D397>=control!$C$10,data!E397<=control!$C$11))","v":false},{"$f":"IF($C421,data!D397,NA())","v":{"$error":"#N/A"}},{"$f":"IF($C421,data!E397,NA())","v":{"$error":"#N/A"}},{"$f":"IF($C421,data!F397,0)","v":0}]
[null,{"$f":"data!B398","v":"Stara Zagora"},{"$f":"CHOOSE(mySelectionType,\nSQRT((data!D398-control!$C$8)^2+(myAspectRatio*(data!E398-control!$C$9))^2)<=control!$C$17,\nAND(data!D398<=control!$C$8,data!E398>=control!$C$9,data!D398>=control!$C$10,data!E398<=control!$C$11))","v":true},{"$f":"IF($C422,data!D398,NA())","v":42.432780000000001},{"$f":"IF($C422,data!E398,NA())","v":25.641940000000002},{"$f":"IF($C422,data!F398,0)","v":143431}]
[null,{"$f":"data!B399","v":"Heidelberg"},{"$f":"CHOOSE(mySelectionType,\nSQRT((data!D399-control!$C$8)^2+(myAspectRatio*(data!E399-control!$C$9))^2)<=control!$C$17,\nAND(data!D399<=control!$C$8,data!E399>=control!$C$9,data!D399>=control!$C$10,data!E399<=control!$C$11))","v":true},{"$f":"IF($C423,data!D399,NA())","v":49.407679999999999},{"$f":"IF($C423,data!E399,NA())","v":8.6907899999999998},{"$f":"IF($C423,data!F399,0)","v":143345}]
[null,{"$f":"data!B400","v":"Blackpool"},{"$f":"CHOOSE(mySelectionType,\nSQRT((data!D400-control!$C$8)^2+(myAspectRatio*(data!E400-control!$C$9))^2)<=control!$C$17,\nAND(data!D400<=control!$C$8,data!E400>=control!$C$9,data!D400>=control!$C$10,data!E400<=control!$C$11))","v":false},{"$f":"IF($C424,data!D400,NA())","v":{"$error":"#N/A"}},{"$f":"IF($C424,data!E400,NA())","v":{"$error":"#N/A"}},{"$f":"IF($C424,data!F400,0)","v":0}]
[null,{"$f":"data!B401","v":"Amiens"},{"$f":"CHOOSE(mySelectionType,\nSQRT((data!D401-control!$C$8)^2+(myAspectRatio*(data!E401-control!$C$9))^2)<=control!$C$17,\nAND(data!D401<=control!$C$8,data!E401>=control!$C$9,data!D401>=control!$C$10,data!E401<=control!$C$11))","v":false},{"$f":"IF($C425,data!D401,NA())","v":{"$error":"#N/A"}},{"$f":"IF($C425,data!E401,NA())","v":{"$error":"#N/A"}},{"$f":"IF($C425,data!F401,0)","v":0}]
[null,{"$f":"data!B402","v":"Middlesbrough"},{"$f":"CHOOSE(mySelectionType,\nSQRT((data!D402-control!$C$8)^2+(myAspectRatio*(data!E402-control!$C$9))^2)<=control!$C$17,\nAND(data!D402<=control!$C$8,data!E402>=control!$C$9,data!D402>=control!$C$10,data!E402<=control!$C$11))","v":false},{"$f":"IF($C426,data!D402,NA())","v":{"$error":"#N/A"}},{"$f":"IF($C426,data!E402,NA())","v":{"$error":"#N/A"}},{"$f":"IF($C426,data!F402,0)","v":0}]
[null,{"$f":"data!B403","v":"Rybnik"},{"$f":"CHOOSE(mySelectionType,\nSQRT((data!D403-control!$C$8)^2+(myAspectRatio*(data!E403-control!$C$9))^2)<=control!$C$17,\nAND(data!D403<=control!$C$8,data!E403>=control!$C$9,data!D403>=control!$C$10,data!E403<=control!$C$11))","v":true},{"$f":"IF($C427,data!D403,NA())","v":50.09713},{"$f":"IF($C427,data!E403,NA())","v":18.541789999999999},{"$f":"IF($C427,data!F403,0)","v":142510}]
[null,{"$f":"data!B404","v":"Tuzla"},{"$f":"CHOOSE(mySelectionType,\nSQRT((data!D404-control!$C$8)^2+(myAspectRatio*(data!E404-control!$C$9))^2)<=control!$C$17,\nAND(data!D404<=control!$C$8,data!E404>=control!$C$9,data!D404>=control!$C$10,data!E404<=control!$C$11))","v":true},{"$f":"IF($C428,data!D404,NA())","v":44.538420000000002},{"$f":"IF($C428,data!E404,NA())","v":18.667090000000002},{"$f":"IF($C428,data!F404,0)","v":142486}]
[null,{"$f":"data!B405","v":"Paderborn"},{"$f":"CHOOSE(mySelectionType,\nSQRT((data!D405-control!$C$8)^2+(myAspectRatio*(data!E405-control!$C$9))^2)<=control!$C$17,\nAND(data!D405<=control!$C$8,data!E405>=control!$C$9,data!D405>=control!$C$10,data!E405<=control!$C$11))","v":true},{"$f":"IF($C429,data!D405,NA())","v":51.719050000000003},{"$f":"IF($C429,data!E405,NA())","v":8.7543900000000008},{"$f":"IF($C429,data!F405,0)","v":142161}]
[null,{"$f":"data!B406","v":"Arnhem"},{"$f":"CHOOSE(mySelectionType,\nSQRT((data!D406-control!$C$8)^2+(myAspectRatio*(data!E406-control!$C$9))^2)<=control!$C$17,\nAND(data!D406<=control!$C$8,data!E406>=control!$C$9,data!D406>=control!$C$10,data!E406<=control!$C$11))","v":false},{"$f":"IF($C430,data!D406,NA())","v":{"$error":"#N/A"}},{"$f":"IF($C430,data!E406,NA())","v":{"$error":"#N/A"}},{"$f":"IF($C430,data!F406,0)","v":0}]
[null,{"$f":"data!B407","v":"Tours"},{"$f":"CHOOSE(mySelectionType,\nSQRT((data!D407-control!$C$8)^2+(myAspectRatio*(data!E407-control!$C$9))^2)<=control!$C$17,\nAND(data!D407<=control!$C$8,data!E407>=control!$C$9,data!D407>=control!$C$10,data!E407<=control!$C$11))","v":false},{"$f":"IF($C431,data!D407,NA())","v":{"$error":"#N/A"}},{"$f":"IF($C431,data!E407,NA())","v":{"$error":"#N/A"}},{"$f":"IF($C431,data!F407,0)","v":0}]
[null,{"$f":"data!B408","v":"Bolton"},{"$f":"CHOOSE(mySelectionType,\nSQRT((data!D408-control!$C$8)^2+(myAspectRatio*(data!E408-control!$C$9))^2)<=control!$C$17,\nAND(data!D408<=control!$C$8,data!E408>=control!$C$9,data!D408>=control!$C$10,data!E408<=control!$C$11))","v":false},{"$f":"IF($C432,data!D408,NA())","v":{"$error":"#N/A"}},{"$f":"IF($C432,data!E408,NA())","v":{"$error":"#N/A"}},{"$f":"IF($C432,data!F408,0)","v":0}]
[null,{"$f":"data!B409","v":"Limoges"},{"$f":"CHOOSE(mySelectionType,\nSQRT((data!D409-control!$C$8)^2+(myAspectRatio*(data!E409-control!$C$9))^2)<=control!$C$17,\nAND(data!D409<=control!$C$8,data!E409>=control!$C$9,data!D409>=control!$C$10,data!E409<=control!$C$11))","v":false},{"$f":"IF($C433,data!D409,NA())","v":{"$error":"#N/A"}},{"$f":"IF($C433,data!E409,NA())","v":{"$error":"#N/A"}},{"$f":"IF($C433,data!F409,0)","v":0}]
[null,{"$f":"data!B410","v":"Rijeka"},{"$f":"CHOOSE(mySelectionType,\nSQRT((data!D410-control!$C$8)^2+(myAspectRatio*(data!E410-control!$C$9))^2)<=control!$C$17,\nAND(data!D410<=control!$C$8,data!E410>=control!$C$9,data!D410>=control!$C$10,data!E410<=control!$C$11))","v":true},{"$f":"IF($C434,data!D410,NA())","v":45.343060000000001},{"$f":"IF($C434,data!E410,NA())","v":14.40917},{"$f":"IF($C434,data!F410,0)","v":141172}]
[null,{"$f":"data!B411","v":"Darmstadt"},{"$f":"CHOOSE(mySelectionType,\nSQRT((data!D411-control!$C$8)^2+(myAspectRatio*(data!E411-control!$C$9))^2)<=control!$C$17,\nAND(data!D411<=control!$C$8,data!E411>=control!$C$9,data!D411>=control!$C$10,data!E411<=control!$C$11))","v":true},{"$f":"IF($C435,data!D411,NA())","v":49.871670000000002},{"$f":"IF($C435,data!E411,NA())","v":8.6502700000000008},{"$f":"IF($C435,data!F411,0)","v":140385}]
[null,{"$f":"data!B412","v":"Tarragona"},{"$f":"CHOOSE(mySelectionType,\nSQRT((data!D412-control!$C$8)^2+(myAspectRatio*(data!E412-control!$C$9))^2)<=control!$C$17,\nAND(data!D412<=control!$C$8,data!E412>=control!$C$9,data!D412>=control!$C$10,data!E412<=control!$C$11))","v":false},{"$f":"IF($C436,data!D412,NA())","v":{"$error":"#N/A"}},{"$f":"IF($C436,data!E412,NA())","v":{"$error":"#N/A"}},{"$f":"IF($C436,data!F412,0)","v":0}]
[null,{"$f":"data!B413","v":"Peterborough"},{"$f":"CHOOSE(mySelectionType,\nSQRT((data!D413-control!$C$8)^2+(myAspectRatio*(data!E413-control!$C$9))^2)<=control!$C$17,\nAND(data!D413<=control!$C$8,data!E413>=control!$C$9,data!D413>=control!$C$10,data!E413<=control!$C$11))","v":false},{"$f":"IF($C437,data!D413,NA())","v":{"$error":"#N/A"}},{"$f":"IF($C437,data!E413,NA())","v":{"$error":"#N/A"}},{"$f":"IF($C437,data!F413,0)","v":0}]
[null,{"$f":"data!B414","v":"Zaanstad"},{"$f":"CHOOSE(mySelectionType,\nSQRT((data!D414-control!$C$8)^2+(myAspectRatio*(data!E414-control!$C$9))^2)<=control!$C$17,\nAND(data!D414<=control!$C$8,data!E414>=control!$C$9,data!D414>=control!$C$10,data!E414<=control!$C$11))","v":false},{"$f":"IF($C438,data!D414,NA())","v":{"$error":"#N/A"}},{"$f":"IF($C438,data!E414,NA())","v":{"$error":"#N/A"}},{"$f":"IF($C438,data!F414,0)","v":0}]
[null,{"$f":"data!B415","v":"Peristéri"},{"$f":"CHOOSE(mySelectionType,\nSQRT((data!D415-control!$C$8)^2+(myAspectRatio*(data!E415-control!$C$9))^2)<=control!$C$17,\nAND(data!D415<=control!$C$8,data!E415>=control!$C$9,data!D415>=control!$C$10,data!E415<=control!$C$11))","v":true},{"$f":"IF($C439,data!D415,NA())","v":38.015389999999996},{"$f":"IF($C439,data!E415,NA())","v":23.691870000000002},{"$f":"IF($C439,data!F415,0)","v":139981}]
[null,{"$f":"data!B416","v":"Amersfoort"},{"$f":"CHOOSE(mySelectionType,\nSQRT((data!D416-control!$C$8)^2+(myAspectRatio*(data!E416-control!$C$9))^2)<=control!$C$17,\nAND(data!D416<=control!$C$8,data!E416>=control!$C$9,data!D416>=control!$C$10,data!E416<=control!$C$11))","v":false},{"$f":"IF($C440,data!D416,NA())","v":{"$error":"#N/A"}},{"$f":"IF($C440,data!E416,NA())","v":{"$error":"#N/A"}},{"$f":"IF($C440,data!F416,0)","v":0}]
[null,{"$f":"data!B417","v":"Stockport"},{"$f":"CHOOSE(mySelectionType,\nSQRT((data!D417-control!$C$8)^2+(myAspectRatio*(data!E417-control!$C$9))^2)<=control!$C$17,\nAND(data!D417<=control!$C$8,data!E417>=control!$C$9,data!D417>=control!$C$10,data!E417<=control!$C$11))","v":false},{"$f":"IF($C441,data!D417,NA())","v":{"$error":"#N/A"}},{"$f":"IF($C441,data!E417,NA())","v":{"$error":"#N/A"}},{"$f":"IF($C441,data!F417,0)","v":0}]
[null,{"$f":"data!B418","v":"Brighton"},{"$f":"CHOOSE(mySelectionType,\nSQRT((data!D418-control!$C$8)^2+(myAspectRatio*(data!E418-control!$C$9))^2)<=control!$C$17,\nAND(data!D418<=control!$C$8,data!E418>=control!$C$9,data!D418>=control!$C$10,data!E418<=control!$C$11))","v":false},{"$f":"IF($C442,data!D418,NA())","v":{"$error":"#N/A"}},{"$f":"IF($C442,data!E418,NA())","v":{"$error":"#N/A"}},{"$f":"IF($C442,data!F418,0)","v":0}]
[null,{"$f":"data!B419","v":"Clermont-Ferrand"},{"$f":"CHOOSE(mySelectionType,\nSQRT((data!D419-control!$C$8)^2+(myAspectRatio*(data!E419-control!$C$9))^2)<=control!$C$17,\nAND(data!D419<=control!$C$8,data!E419>=control!$C$9,data!D419>=control!$C$10,data!E419<=control!$C$11))","v":false},{"$f":"IF($C443,data!D419,NA())","v":{"$error":"#N/A"}},{"$f":"IF($C443,data!E419,NA())","v":{"$error":"#N/A"}},{"$f":"IF($C443,data!F419,0)","v":0}]
[null,{"$f":"data!B420","v":"Telford"},{"$f":"CHOOSE(mySelectionType,\nSQRT((data!D420-control!$C$8)^2+(myAspectRatio*(data!E420-control!$C$9))^2)<=control!$C$17,\nAND(data!D420<=control!$C$8,data!E420>=control!$C$9,data!D420>=control!$C$10,data!E420<=control!$C$11))","v":false},{"$f":"IF($C444,data!D420,NA())","v":{"$error":"#N/A"}},{"$f":"IF($C444,data!E420,NA())","v":{"$error":"#N/A"}},{"$f":"IF($C444,data!F420,0)","v":0}]
[null,{"$f":"data!B421","v":"Baia Mare"},{"$f":"CHOOSE(mySelectionType,\nSQRT((data!D421-control!$C$8)^2+(myAspectRatio*(data!E421-control!$C$9))^2)<=control!$C$17,\nAND(data!D421<=control!$C$8,data!E421>=control!$C$9,data!D421>=control!$C$10,data!E421<=control!$C$11))","v":true},{"$f":"IF($C445,data!D421,NA())","v":47.653309999999998},{"$f":"IF($C445,data!E421,NA())","v":23.57949},{"$f":"IF($C445,data!F421,0)","v":137976}]
[null,{"$f":"data!B422","v":"Irákleion"},{"$f":"CHOOSE(mySelectionType,\nSQRT((data!D422-control!$C$8)^2+(myAspectRatio*(data!E422-control!$C$9))^2)<=control!$C$17,\nAND(data!D422<=control!$C$8,data!E422>=control!$C$9,data!D422>=control!$C$10,data!E422<=control!$C$11))","v":false},{"$f":"IF($C446,data!D422,NA())","v":{"$error":"#N/A"}},{"$f":"IF($C446,data!E422,NA())","v":{"$error":"#N/A"}},{"$f":"IF($C446,data!F422,0)","v":0}]
[null,{"$f":"data!B423","v":"Foggia"},{"$f":"CHOOSE(mySelectionType,\nSQRT((data!D423-control!$C$8)^2+(myAspectRatio*(data!E423-control!$C$9))^2)<=control!$C$17,\nAND(data!D423<=control!$C$8,data!E423>=control!$C$9,data!D423>=control!$C$10,data!E423<=control!$C$11))","v":true},{"$f":"IF($C447,data!D423,NA())","v":41.458449999999999},{"$f":"IF($C447,data!E423,NA())","v":15.551880000000001},{"$f":"IF($C447,data!F423,0)","v":137032}]
[null,{"$f":"data!B424","v":"Apeldoorn"},{"$f":"CHOOSE(mySelectionType,\nSQRT((data!D424-control!$C$8)^2+(myAspectRatio*(data!E424-control!$C$9))^2)<=control!$C$17,\nAND(data!D424<=control!$C$8,data!E424>=control!$C$9,data!D424>=control!$C$10,data!E424<=control!$C$11))","v":false},{"$f":"IF($C448,data!D424,NA())","v":{"$error":"#N/A"}},{"$f":"IF($C448,data!E424,NA())","v":{"$error":"#N/A"}},{"$f":"IF($C448,data!F424,0)","v":0}]
[null,{"$f":"data!B425","v":"Baia Mare"},{"$f":"CHOOSE(mySelectionType,\nSQRT((data!D425-control!$C$8)^2+(myAspectRatio*(data!E425-control!$C$9))^2)<=control!$C$17,\nAND(data!D425<=control!$C$8,data!E425>=control!$C$9,data!D425>=control!$C$10,data!E425<=control!$C$11))","v":true},{"$f":"IF($C449,data!D425,NA())","v":47.657290000000003},{"$f":"IF($C449,data!E425,NA())","v":23.568079999999998},{"$f":"IF($C449,data!F425,0)","v":136553}]
[null,{"$f":"data!B426","v":"Podgorica"},{"$f":"CHOOSE(mySelectionType,\nSQRT((data!D426-control!$C$8)^2+(myAspectRatio*(data!E426-control!$C$9))^2)<=control!$C$17,\nAND(data!D426<=control!$C$8,data!E426>=control!$C$9,data!D426>=control!$C$10,data!E426<=control!$C$11))","v":true},{"$f":"IF($C450,data!D426,NA())","v":42.441110000000002},{"$f":"IF($C450,data!E426,NA())","v":19.26361},{"$f":"IF($C450,data!F426,0)","v":136473}]
[null,{"$f":"data!B427","v":"Lleida"},{"$f":"CHOOSE(mySelectionType,\nSQRT((data!D427-control!$C$8)^2+(myAspectRatio*(data!E427-control!$C$9))^2)<=control!$C$17,\nAND(data!D427<=control!$C$8,data!E427>=control!$C$9,data!D427>=control!$C$10,data!E427<=control!$C$11))","v":false},{"$f":"IF($C451,data!D427,NA())","v":{"$error":"#N/A"}},{"$f":"IF($C451,data!E427,NA())","v":{"$error":"#N/A"}},{"$f":"IF($C451,data!F427,0)","v":0}]
[null,{"$f":"data!B428","v":"West Bromwich"},{"$f":"CHOOSE(mySelectionType,\nSQRT((data!D428-control!$C$8)^2+(myAspectRatio*(data!E428-control!$C$9))^2)<=control!$C$17,\nAND(data!D428<=control!$C$8,data!E428>=control!$C$9,data!D428>=control!$C$10,data!E428<=control!$C$11))","v":false},{"$f":"IF($C452,data!D428,NA())","v":{"$error":"#N/A"}},{"$f":"IF($C452,data!E428,NA())","v":{"$error":"#N/A"}},{"$f":"IF($C452,data!F428,0)","v":0}]
[null,{"$f":"data!B429","v":"Marbella"},{"$f":"CHOOSE(mySelectionType,\nSQRT((data!D429-control!$C$8)^2+(myAspectRatio*(data!E429-control!$C$9))^2)<=control!$C$17,\nAND(data!D429<=control!$C$8,data!E429>=control!$C$9,data!D429>=control!$C$10,data!E429<=control!$C$11))","v":false},{"$f":"IF($C453,data!D429,NA())","v":{"$error":"#N/A"}},{"$f":"IF($C453,data!E429,NA())","v":{"$error":"#N/A"}},{"$f":"IF($C453,data!F429,0)","v":0}]
[null,{"$f":"data!B430","v":"'s-Hertogenbosch"},{"$f":"CHOOSE(mySelectionType,\nSQRT((data!D430-control!$C$8)^2+(myAspectRatio*(data!E430-control!$C$9))^2)<=control!$C$17,\nAND(data!D430<=control!$C$8,data!E430>=control!$C$9,data!D430>=control!$C$10,data!E430<=control!$C$11))","v":false},{"$f":"IF($C454,data!D430,NA())","v":{"$error":"#N/A"}},{"$f":"IF($C454,data!E430,NA())","v":{"$error":"#N/A"}},{"$f":"IF($C454,data!F430,0)","v":0}]
[null,{"$f":"data!B431","v":"León"},{"$f":"CHOOSE(mySelectionType,\nSQRT((data!D431-control!$C$8)^2+(myAspectRatio*(data!E431-control!$C$9))^2)<=control!$C$17,\nAND(data!D431<=control!$C$8,data!E431>=control!$C$9,data!D431>=control!$C$10,data!E431<=control!$C$11))","v":false},{"$f":"IF($C455,data!D431,NA())","v":{"$error":"#N/A"}},{"$f":"IF($C455,data!E431,NA())","v":{"$error":"#N/A"}},{"$f":"IF($C455,data!F431,0)","v":0}]
[null,{"$f":"data!B432","v":"Slough"},{"$f":"CHOOSE(mySelectionType,\nSQRT((data!D432-control!$C$8)^2+(myAspectRatio*(data!E432-control!$C$9))^2)<=control!$C$17,\nAND(data!D432<=control!$C$8,data!E432>=control!$C$9,data!D432>=control!$C$10,data!E432<=control!$C$11))","v":false},{"$f":"IF($C456,data!D432,NA())","v":{"$error":"#N/A"}},{"$f":"IF($C456,data!E432,NA())","v":{"$error":"#N/A"}},{"$f":"IF($C456,data!F432,0)","v":0}]
[null,{"$f":"data!B433","v":"Inegol"},{"$f":"CHOOSE(mySelectionType,\nSQRT((data!D433-control!$C$8)^2+(myAspectRatio*(data!E433-control!$C$9))^2)<=control!$C$17,\nAND(data!D433<=control!$C$8,data!E433>=control!$C$9,data!D433>=control!$C$10,data!E433<=control!$C$11))","v":true},{"$f":"IF($C457,data!D433,NA())","v":40.078060000000001},{"$f":"IF($C457,data!E433,NA())","v":29.51333},{"$f":"IF($C457,data!F433,0)","v":133959}]
[null,{"$f":"data!B434","v":"Würzburg"},{"$f":"CHOOSE(mySelectionType,\nSQRT((data!D434-control!$C$8)^2+(myAspectRatio*(data!E434-control!$C$9))^2)<=control!$C$17,\nAND(data!D434<=control!$C$8,data!E434>=control!$C$9,data!D434>=control!$C$10,data!E434<=control!$C$11))","v":true},{"$f":"IF($C458,data!D434,NA())","v":49.793909999999997},{"$f":"IF($C458,data!E434,NA())","v":9.9512099999999997},{"$f":"IF($C458,data!F434,0)","v":133731}]
[null,{"$f":"data!B435","v":"Reggio nell'Emilia"},{"$f":"CHOOSE(mySelectionType,\nSQRT((data!D435-control!$C$8)^2+(myAspectRatio*(data!E435-control!$C$9))^2)<=control!$C$17,\nAND(data!D435<=control!$C$8,data!E435>=control!$C$9,data!D435>=control!$C$10,data!E435<=control!$C$11))","v":true},{"$f":"IF($C459,data!D435,NA())","v":44.698250000000002},{"$f":"IF($C459,data!E435,NA())","v":10.63125},{"$f":"IF($C459,data!F435,0)","v":133296}]
[null,{"$f":"data!B436","v":"Hoofddorp"},{"$f":"CHOOSE(mySelectionType,\nSQRT((data!D436-control!$C$8)^2+(myAspectRatio*(data!E436-control!$C$9))^2)<=control!$C$17,\nAND(data!D436<=control!$C$8,data!E436>=control!$C$9,data!D436>=control!$C$10,data!E436<=control!$C$11))","v":false},{"$f":"IF($C460,data!D436,NA())","v":{"$error":"#N/A"}},{"$f":"IF($C460,data!E436,NA())","v":{"$error":"#N/A"}},{"$f":"IF($C460,data!F436,0)","v":0}]
[null,{"$f":"data!B437","v":"Villeurbanne"},{"$f":"CHOOSE(mySelectionType,\nSQRT((data!D437-control!$C$8)^2+(myAspectRatio*(data!E437-control!$C$9))^2)<=control!$C$17,\nAND(data!D437<=control!$C$8,data!E437>=control!$C$9,data!D437>=control!$C$10,data!E437<=control!$C$11))","v":false},{"$f":"IF($C461,data!D437,NA())","v":{"$error":"#N/A"}},{"$f":"IF($C461,data!E437,NA())","v":{"$error":"#N/A"}},{"$f":"IF($C461,data!F437,0)","v":0}]
[null,{"$f":"data!B438","v":"Buzău"},{"$f":"CHOOSE(mySelectionType,\nSQRT((data!D438-control!$C$8)^2+(myAspectRatio*(data!E438-control!$C$9))^2)<=control!$C$17,\nAND(data!D438<=control!$C$8,data!E438>=control!$C$9,data!D438>=control!$C$10,data!E438<=control!$C$11))","v":true},{"$f":"IF($C462,data!D438,NA())","v":45.15},{"$f":"IF($C462,data!E438,NA())","v":26.83333},{"$f":"IF($C462,data!F438,0)","v":130954}]
[null,{"$f":"data!B439","v":"Pinsk"},{"$f":"CHOOSE(mySelectionType,\nSQRT((data!D439-control!$C$8)^2+(myAspectRatio*(data!E439-control!$C$9))^2)<=control!$C$17,\nAND(data!D439<=control!$C$8,data!E439>=control!$C$9,data!D439>=control!$C$10,data!E439<=control!$C$11))","v":true},{"$f":"IF($C463,data!D439,NA())","v":52.122900000000001},{"$f":"IF($C463,data!E439,NA())","v":26.095099999999999},{"$f":"IF($C463,data!F439,0)","v":130777}]
[null,{"$f":"data!B440","v":"Dąbrowa Górnicza"},{"$f":"CHOOSE(mySelectionType,\nSQRT((data!D440-control!$C$8)^2+(myAspectRatio*(data!E440-control!$C$9))^2)<=control!$C$17,\nAND(data!D440<=control!$C$8,data!E440>=control!$C$9,data!D440>=control!$C$10,data!E440<=control!$C$11))","v":true},{"$f":"IF($C464,data!D440,NA())","v":50.318179999999998},{"$f":"IF($C464,data!E440,NA())","v":19.237400000000001},{"$f":"IF($C464,data!F440,0)","v":130601}]
[null,{"$f":"data!B441","v":"Šiauliai"},{"$f":"CHOOSE(mySelectionType,\nSQRT((data!D441-control!$C$8)^2+(myAspectRatio*(data!E441-control!$C$9))^2)<=control!$C$17,\nAND(data!D441<=control!$C$8,data!E441>=control!$C$9,data!D441>=control!$C$10,data!E441<=control!$C$11))","v":true},{"$f":"IF($C465,data!D441,NA())","v":55.933329999999998},{"$f":"IF($C465,data!E441,NA())","v":23.316669999999998},{"$f":"IF($C465,data!F441,0)","v":130587}]
[null,{"$f":"data!B442","v":"Nikopol’"},{"$f":"CHOOSE(mySelectionType,\nSQRT((data!D442-control!$C$8)^2+(myAspectRatio*(data!E442-control!$C$9))^2)<=control!$C$17,\nAND(data!D442<=control!$C$8,data!E442>=control!$C$9,data!D442>=control!$C$10,data!E442<=control!$C$11))","v":true},{"$f":"IF($C466,data!D442,NA())","v":47.571190000000001},{"$f":"IF($C466,data!E442,NA())","v":34.396369999999997},{"$f":"IF($C466,data!F442,0)","v":130500}]
[null,{"$f":"data!B443","v":"Syevyerodonets’k"},{"$f":"CHOOSE(mySelectionType,\nSQRT((data!D443-control!$C$8)^2+(myAspectRatio*(data!E443-control!$C$9))^2)<=control!$C$17,\nAND(data!D443<=control!$C$8,data!E443>=control!$C$9,data!D443>=control!$C$10,data!E443<=control!$C$11))","v":false},{"$f":"IF($C467,data!D443,NA())","v":{"$error":"#N/A"}},{"$f":"IF($C467,data!E443,NA())","v":{"$error":"#N/A"}},{"$f":"IF($C467,data!F443,0)","v":0}]
[null,{"$f":"data!B444","v":"Tychy"},{"$f":"CHOOSE(mySelectionType,\nSQRT((data!D444-control!$C$8)^2+(myAspectRatio*(data!E444-control!$C$9))^2)<=control!$C$17,\nAND(data!D444<=control!$C$8,data!E444>=control!$C$9,data!D444>=control!$C$10,data!E444<=control!$C$11))","v":true},{"$f":"IF($C468,data!D444,NA())","v":50.137169999999998},{"$f":"IF($C468,data!E444,NA())","v":18.96641},{"$f":"IF($C468,data!F444,0)","v":130000}]
[null,{"$f":"data!B445","v":"Tokat"},{"$f":"CHOOSE(mySelectionType,\nSQRT((data!D445-control!$C$8)^2+(myAspectRatio*(data!E445-control!$C$9))^2)<=control!$C$17,\nAND(data!D445<=control!$C$8,data!E445>=control!$C$9,data!D445>=control!$C$10,data!E445<=control!$C$11))","v":false},{"$f":"IF($C469,data!D445,NA())","v":{"$error":"#N/A"}},{"$f":"IF($C469,data!E445,NA())","v":{"$error":"#N/A"}},{"$f":"IF($C469,data!F445,0)","v":0}]
[null,{"$f":"data!B446","v":"Acilia-Castel Fusano-Ostia Antica"},{"$f":"CHOOSE(mySelectionType,\nSQRT((data!D446-control!$C$8)^2+(myAspectRatio*(data!E446-control!$C$9))^2)<=control!$C$17,\nAND(data!D446<=control!$C$8,data!E446>=control!$C$9,data!D446>=control!$C$10,data!E446<=control!$C$11))","v":true},{"$f":"IF($C470,data!D446,NA())","v":41.763370000000002},{"$f":"IF($C470,data!E446,NA())","v":12.330780000000001},{"$f":"IF($C470,data!F446,0)","v":129362}]
[null,{"$f":"data!B447","v":"Regensburg"},{"$f":"CHOOSE(mySelectionType,\nSQRT((data!D447-control!$C$8)^2+(myAspectRatio*(data!E447-control!$C$9))^2)<=control!$C$17,\nAND(data!D447<=control!$C$8,data!E447>=control!$C$9,data!D447>=control!$C$10,data!E447<=control!$C$11))","v":true},{"$f":"IF($C471,data!D447,NA())","v":49.034509999999997},{"$f":"IF($C471,data!E447,NA())","v":12.11923},{"$f":"IF($C471,data!F447,0)","v":129151}]
[null,{"$f":"data!B448","v":"Lárisa"},{"$f":"CHOOSE(mySelectionType,\nSQRT((data!D448-control!$C$8)^2+(myAspectRatio*(data!E448-control!$C$9))^2)<=control!$C$17,\nAND(data!D448<=control!$C$8,data!E448>=control!$C$9,data!D448>=control!$C$10,data!E448<=control!$C$11))","v":true},{"$f":"IF($C472,data!D448,NA())","v":39.636890000000001},{"$f":"IF($C472,data!E448,NA())","v":22.41761},{"$f":"IF($C472,data!F448,0)","v":128758}]
[null,{"$f":"data!B449","v":"Gloucester"},{"$f":"CHOOSE(mySelectionType,\nSQRT((data!D449-control!$C$8)^2+(myAspectRatio*(data!E449-control!$C$9))^2)<=control!$C$17,\nAND(data!D449<=control!$C$8,data!E449>=control!$C$9,data!D449>=control!$C$10,data!E449<=control!$C$11))","v":false},{"$f":"IF($C473,data!D449,NA())","v":{"$error":"#N/A"}},{"$f":"IF($C473,data!E449,NA())","v":{"$error":"#N/A"}},{"$f":"IF($C473,data!F449,0)","v":0}]
[null,{"$f":"data!B450","v":"Oulu"},{"$f":"CHOOSE(mySelectionType,\nSQRT((data!D450-control!$C$8)^2+(myAspectRatio*(data!E450-control!$C$9))^2)<=control!$C$17,\nAND(data!D450<=control!$C$8,data!E450>=control!$C$9,data!D450>=control!$C$10,data!E450<=control!$C$11))","v":false},{"$f":"IF($C474,data!D450,NA())","v":{"$error":"#N/A"}},{"$f":"IF($C474,data!E450,NA())","v":{"$error":"#N/A"}},{"$f":"IF($C474,data!F450,0)","v":0}]
[null,{"$f":"data!B451","v":"Cambridge"},{"$f":"CHOOSE(mySelectionType,\nSQRT((data!D451-control!$C$8)^2+(myAspectRatio*(data!E451-control!$C$9))^2)<=control!$C$17,\nAND(data!D451<=control!$C$8,data!E451>=control!$C$9,data!D451>=control!$C$10,data!E451<=control!$C$11))","v":false},{"$f":"IF($C475,data!D451,NA())","v":{"$error":"#N/A"}},{"$f":"IF($C475,data!E451,NA())","v":{"$error":"#N/A"}},{"$f":"IF($C475,data!F451,0)","v":0}]
[null,{"$f":"data!B452","v":"Besançon"},{"$f":"CHOOSE(mySelectionType,\nSQRT((data!D452-control!$C$8)^2+(myAspectRatio*(data!E452-control!$C$9))^2)<=control!$C$17,\nAND(data!D452<=control!$C$8,data!E452>=control!$C$9,data!D452>=control!$C$10,data!E452<=control!$C$11))","v":false},{"$f":"IF($C476,data!D452,NA())","v":{"$error":"#N/A"}},{"$f":"IF($C476,data!E452,NA())","v":{"$error":"#N/A"}},{"$f":"IF($C476,data!F452,0)","v":0}]
[null,{"$f":"data!B453","v":"Győr"},{"$f":"CHOOSE(mySelectionType,\nSQRT((data!D453-control!$C$8)^2+(myAspectRatio*(data!E453-control!$C$9))^2)<=control!$C$17,\nAND(data!D453<=control!$C$8,data!E453>=control!$C$9,data!D453>=control!$C$10,data!E453<=control!$C$11))","v":true},{"$f":"IF($C477,data!D453,NA())","v":47.683329999999998},{"$f":"IF($C477,data!E453,NA())","v":17.635120000000001},{"$f":"IF($C477,data!F453,0)","v":128265}]
[null,{"$f":"data!B454","v":"Uppsala"},{"$f":"CHOOSE(mySelectionType,\nSQRT((data!D454-control!$C$8)^2+(myAspectRatio*(data!E454-control!$C$9))^2)<=control!$C$17,\nAND(data!D454<=control!$C$8,data!E454>=control!$C$9,data!D454>=control!$C$10,data!E454<=control!$C$11))","v":true},{"$f":"IF($C478,data!D454,NA())","v":59.858820000000001},{"$f":"IF($C478,data!E454,NA())","v":17.63889},{"$f":"IF($C478,data!F454,0)","v":127734}]
[null,{"$f":"data!B455","v":"Opole"},{"$f":"CHOOSE(mySelectionType,\nSQRT((data!D455-control!$C$8)^2+(myAspectRatio*(data!E455-control!$C$9))^2)<=control!$C$17,\nAND(data!D455<=control!$C$8,data!E455>=control!$C$9,data!D455>=control!$C$10,data!E455<=control!$C$11))","v":true},{"$f":"IF($C479,data!D455,NA())","v":50.672110000000004},{"$f":"IF($C479,data!E455,NA())","v":17.925329999999999},{"$f":"IF($C479,data!F455,0)","v":127676}]
[null,{"$f":"data!B456","v":"Elbląg"},{"$f":"CHOOSE(mySelectionType,\nSQRT((data!D456-control!$C$8)^2+(myAspectRatio*(data!E456-control!$C$9))^2)<=control!$C$17,\nAND(data!D456<=control!$C$8,data!E456>=control!$C$9,data!D456>=control!$C$10,data!E456<=control!$C$11))","v":true},{"$f":"IF($C480,data!D456,NA())","v":54.152200000000001},{"$f":"IF($C480,data!E456,NA())","v":19.408840000000001},{"$f":"IF($C480,data!F456,0)","v":127558}]
[null,{"$f":"data!B457","v":"Płock"},{"$f":"CHOOSE(mySelectionType,\nSQRT((data!D457-control!$C$8)^2+(myAspectRatio*(data!E457-control!$C$9))^2)<=control!$C$17,\nAND(data!D457<=control!$C$8,data!E457>=control!$C$9,data!D457>=control!$C$10,data!E457<=control!$C$11))","v":true},{"$f":"IF($C481,data!D457,NA())","v":52.546819999999997},{"$f":"IF($C481,data!E457,NA())","v":19.706379999999999},{"$f":"IF($C481,data!F457,0)","v":127474}]
[null,{"$f":"data!B458","v":"Wałbrzych"},{"$f":"CHOOSE(mySelectionType,\nSQRT((data!D458-control!$C$8)^2+(myAspectRatio*(data!E458-control!$C$9))^2)<=control!$C$17,\nAND(data!D458<=control!$C$8,data!E458>=control!$C$9,data!D458>=control!$C$10,data!E458<=control!$C$11))","v":true},{"$f":"IF($C482,data!D458,NA())","v":50.771410000000003},{"$f":"IF($C482,data!E458,NA())","v":16.284320000000001},{"$f":"IF($C482,data!F458,0)","v":127431}]
[null,{"$f":"data!B459","v":"Cadiz"},{"$f":"CHOOSE(mySelectionType,\nSQRT((data!D459-control!$C$8)^2+(myAspectRatio*(data!E459-control!$C$9))^2)<=control!$C$17,\nAND(data!D459<=control!$C$8,data!E459>=control!$C$9,data!D459>=control!$C$10,data!E459<=control!$C$11))","v":false},{"$f":"IF($C483,data!D459,NA())","v":{"$error":"#N/A"}},{"$f":"IF($C483,data!E459,NA())","v":{"$error":"#N/A"}},{"$f":"IF($C483,data!F459,0)","v":0}]
[null,{"$f":"data!B460","v":"Edirne"},{"$f":"CHOOSE(mySelectionType,\nSQRT((data!D460-control!$C$8)^2+(myAspectRatio*(data!E460-control!$C$9))^2)<=control!$C$17,\nAND(data!D460<=control!$C$8,data!E460>=control!$C$9,data!D460>=control!$C$10,data!E460<=control!$C$11))","v":true},{"$f":"IF($C484,data!D460,NA())","v":41.677190000000003},{"$f":"IF($C484,data!E460,NA())","v":26.555969999999999},{"$f":"IF($C484,data!F460,0)","v":126470}]
[null,{"$f":"data!B461","v":"Salerno"},{"$f":"CHOOSE(mySelectionType,\nSQRT((data!D461-control!$C$8)^2+(myAspectRatio*(data!E461-control!$C$9))^2)<=control!$C$17,\nAND(data!D461<=control!$C$8,data!E461>=control!$C$9,data!D461>=control!$C$10,data!E461<=control!$C$11))","v":true},{"$f":"IF($C485,data!D461,NA())","v":40.675449999999998},{"$f":"IF($C485,data!E461,NA())","v":14.793279999999999},{"$f":"IF($C485,data!F461,0)","v":125797}]
[null,{"$f":"data!B462","v":"Watford"},{"$f":"CHOOSE(mySelectionType,\nSQRT((data!D462-control!$C$8)^2+(myAspectRatio*(data!E462-control!$C$9))^2)<=control!$C$17,\nAND(data!D462<=control!$C$8,data!E462>=control!$C$9,data!D462>=control!$C$10,data!E462<=control!$C$11))","v":false},{"$f":"IF($C486,data!D462,NA())","v":{"$error":"#N/A"}},{"$f":"IF($C486,data!E462,NA())","v":{"$error":"#N/A"}},{"$f":"IF($C486,data!F462,0)","v":0}]
[null,{"$f":"data!B463","v":"Orsha"},{"$f":"CHOOSE(mySelectionType,\nSQRT((data!D463-control!$C$8)^2+(myAspectRatio*(data!E463-control!$C$9))^2)<=control!$C$17,\nAND(data!D463<=control!$C$8,data!E463>=control!$C$9,data!D463>=control!$C$10,data!E463<=control!$C$11))","v":true},{"$f":"IF($C487,data!D463,NA())","v":54.508099999999999},{"$f":"IF($C487,data!E463,NA())","v":30.417200000000001},{"$f":"IF($C487,data!F463,0)","v":125347}]
[null,{"$f":"data!B464","v":"Bălţi"},{"$f":"CHOOSE(mySelectionType,\nSQRT((data!D464-control!$C$8)^2+(myAspectRatio*(data!E464-control!$C$9))^2)<=control!$C$17,\nAND(data!D464<=control!$C$8,data!E464>=control!$C$9,data!D464>=control!$C$10,data!E464<=control!$C$11))","v":true},{"$f":"IF($C488,data!D464,NA())","v":47.761670000000002},{"$f":"IF($C488,data!E464,NA())","v":27.928889999999999},{"$f":"IF($C488,data!F464,0)","v":125000}]
[null,{"$f":"data!B465","v":"Sloviansk"},{"$f":"CHOOSE(mySelectionType,\nSQRT((data!D465-control!$C$8)^2+(myAspectRatio*(data!E465-control!$C$9))^2)<=control!$C$17,\nAND(data!D465<=control!$C$8,data!E465>=control!$C$9,data!D465>=control!$C$10,data!E465<=control!$C$11))","v":false},{"$f":"IF($C489,data!D465,NA())","v":{"$error":"#N/A"}},{"$f":"IF($C489,data!E465,NA())","v":{"$error":"#N/A"}},{"$f":"IF($C489,data!F465,0)","v":0}]
[null,{"$f":"data!B466","v":"Gorzów Wielkopolski"},{"$f":"CHOOSE(mySelectionType,\nSQRT((data!D466-control!$C$8)^2+(myAspectRatio*(data!E466-control!$C$9))^2)<=control!$C$17,\nAND(data!D466<=control!$C$8,data!E466>=control!$C$9,data!D466>=control!$C$10,data!E466<=control!$C$11))","v":true},{"$f":"IF($C490,data!D466,NA())","v":52.736789999999999},{"$f":"IF($C490,data!E466,NA())","v":15.22878},{"$f":"IF($C490,data!F466,0)","v":124430}]
[null,{"$f":"data!B467","v":"Orléans"},{"$f":"CHOOSE(mySelectionType,\nSQRT((data!D467-control!$C$8)^2+(myAspectRatio*(data!E467-control!$C$9))^2)<=control!$C$17,\nAND(data!D467<=control!$C$8,data!E467>=control!$C$9,data!D467>=control!$C$10,data!E467<=control!$C$11))","v":false},{"$f":"IF($C491,data!D467,NA())","v":{"$error":"#N/A"}},{"$f":"IF($C491,data!E467,NA())","v":{"$error":"#N/A"}},{"$f":"IF($C491,data!F467,0)","v":0}]
[null,{"$f":"data!B468","v":"Metz"},{"$f":"CHOOSE(mySelectionType,\nSQRT((data!D468-control!$C$8)^2+(myAspectRatio*(data!E468-control!$C$9))^2)<=control!$C$17,\nAND(data!D468<=control!$C$8,data!E468>=control!$C$9,data!D468>=control!$C$10,data!E468<=control!$C$11))","v":false},{"$f":"IF($C492,data!D468,NA())","v":{"$error":"#N/A"}},{"$f":"IF($C492,data!E468,NA())","v":{"$error":"#N/A"}},{"$f":"IF($C492,data!F468,0)","v":0}]
[null,{"$f":"data!B469","v":"Wolfsburg"},{"$f":"CHOOSE(mySelectionType,\nSQRT((data!D469-control!$C$8)^2+(myAspectRatio*(data!E469-control!$C$9))^2)<=control!$C$17,\nAND(data!D469<=control!$C$8,data!E469>=control!$C$9,data!D469>=control!$C$10,data!E469<=control!$C$11))","v":true},{"$f":"IF($C493,data!D469,NA())","v":52.424520000000001},{"$f":"IF($C493,data!E469,NA())","v":10.781499999999999},{"$f":"IF($C493,data!F469,0)","v":123064}]
[null,{"$f":"data!B470","v":"Dos Hermanas"},{"$f":"CHOOSE(mySelectionType,\nSQRT((data!D470-control!$C$8)^2+(myAspectRatio*(data!E470-control!$C$9))^2)<=control!$C$17,\nAND(data!D470<=control!$C$8,data!E470>=control!$C$9,data!D470>=control!$C$10,data!E470<=control!$C$11))","v":false},{"$f":"IF($C494,data!D470,NA())","v":{"$error":"#N/A"}},{"$f":"IF($C494,data!E470,NA())","v":{"$error":"#N/A"}},{"$f":"IF($C494,data!F470,0)","v":0}]
[null,{"$f":"data!B471","v":"Recklinghausen"},{"$f":"CHOOSE(mySelectionType,\nSQRT((data!D471-control!$C$8)^2+(myAspectRatio*(data!E471-control!$C$9))^2)<=control!$C$17,\nAND(data!D471<=control!$C$8,data!E471>=control!$C$9,data!D471>=control!$C$10,data!E471<=control!$C$11))","v":false},{"$f":"IF($C495,data!D471,NA())","v":{"$error":"#N/A"}},{"$f":"IF($C495,data!E471,NA())","v":{"$error":"#N/A"}},{"$f":"IF($C495,data!F471,0)","v":0}]
[null,{"$f":"data!B472","v":"Maastricht"},{"$f":"CHOOSE(mySelectionType,\nSQRT((data!D472-control!$C$8)^2+(myAspectRatio*(data!E472-control!$C$9))^2)<=control!$C$17,\nAND(data!D472<=control!$C$8,data!E472>=control!$C$9,data!D472>=control!$C$10,data!E472<=control!$C$11))","v":false},{"$f":"IF($C496,data!D472,NA())","v":{"$error":"#N/A"}},{"$f":"IF($C496,data!E472,NA())","v":{"$error":"#N/A"}},{"$f":"IF($C496,data!F472,0)","v":0}]
[null,{"$f":"data!B473","v":"Tekirdağ"},{"$f":"CHOOSE(mySelectionType,\nSQRT((data!D473-control!$C$8)^2+(myAspectRatio*(data!E473-control!$C$9))^2)<=control!$C$17,\nAND(data!D473<=control!$C$8,data!E473>=control!$C$9,data!D473>=control!$C$10,data!E473<=control!$C$11))","v":true},{"$f":"IF($C497,data!D473,NA())","v":40.978009999999998},{"$f":"IF($C497,data!E473,NA())","v":27.508520000000001},{"$f":"IF($C497,data!F473,0)","v":122287}]
[null,{"$f":"data!B474","v":"Aalborg"},{"$f":"CHOOSE(mySelectionType,\nSQRT((data!D474-control!$C$8)^2+(myAspectRatio*(data!E474-control!$C$9))^2)<=control!$C$17,\nAND(data!D474<=control!$C$8,data!E474>=control!$C$9,data!D474>=control!$C$10,data!E474<=control!$C$11))","v":false},{"$f":"IF($C498,data!D474,NA())","v":{"$error":"#N/A"}},{"$f":"IF($C498,data!E474,NA())","v":{"$error":"#N/A"}},{"$f":"IF($C498,data!F474,0)","v":0}]
[null,{"$f":"data!B475","v":"Göttingen"},{"$f":"CHOOSE(mySelectionType,\nSQRT((data!D475-control!$C$8)^2+(myAspectRatio*(data!E475-control!$C$9))^2)<=control!$C$17,\nAND(data!D475<=control!$C$8,data!E475>=control!$C$9,data!D475>=control!$C$10,data!E475<=control!$C$11))","v":true},{"$f":"IF($C499,data!D475,NA())","v":51.53443},{"$f":"IF($C499,data!E475,NA())","v":9.9322800000000004},{"$f":"IF($C499,data!F475,0)","v":122149}]
[null,{"$f":"data!B476","v":"Durrës"},{"$f":"CHOOSE(mySelectionType,\nSQRT((data!D476-control!$C$8)^2+(myAspectRatio*(data!E476-control!$C$9))^2)<=control!$C$17,\nAND(data!D476<=control!$C$8,data!E476>=control!$C$9,data!D476>=control!$C$10,data!E476<=control!$C$11))","v":true},{"$f":"IF($C500,data!D476,NA())","v":41.323059999999998},{"$f":"IF($C500,data!E476,NA())","v":19.441389999999998},{"$f":"IF($C500,data!F476,0)","v":122034}]
[null,{"$f":"data!B477","v":"Mataró"},{"$f":"CHOOSE(mySelectionType,\nSQRT((data!D477-control!$C$8)^2+(myAspectRatio*(data!E477-control!$C$9))^2)<=control!$C$17,\nAND(data!D477<=control!$C$8,data!E477>=control!$C$9,data!D477>=control!$C$10,data!E477<=control!$C$11))","v":false},{"$f":"IF($C501,data!D477,NA())","v":{"$error":"#N/A"}},{"$f":"IF($C501,data!E477,NA())","v":{"$error":"#N/A"}},{"$f":"IF($C501,data!F477,0)","v":0}]
[null,{"$f":"data!B478","v":"Bern"},{"$f":"CHOOSE(mySelectionType,\nSQRT((data!D478-control!$C$8)^2+(myAspectRatio*(data!E478-control!$C$9))^2)<=control!$C$17,\nAND(data!D478<=control!$C$8,data!E478>=control!$C$9,data!D478>=control!$C$10,data!E478<=control!$C$11))","v":false},{"$f":"IF($C502,data!D478,NA())","v":{"$error":"#N/A"}},{"$f":"IF($C502,data!E478,NA())","v":{"$error":"#N/A"}},{"$f":"IF($C502,data!F478,0)","v":0}]
[null,{"$f":"data!B479","v":"Stavanger"},{"$f":"CHOOSE(mySelectionType,\nSQRT((data!D479-control!$C$8)^2+(myAspectRatio*(data!E479-control!$C$9))^2)<=control!$C$17,\nAND(data!D479<=control!$C$8,data!E479>=control!$C$9,data!D479>=control!$C$10,data!E479<=control!$C$11))","v":false},{"$f":"IF($C503,data!D479,NA())","v":{"$error":"#N/A"}},{"$f":"IF($C503,data!E479,NA())","v":{"$error":"#N/A"}},{"$f":"IF($C503,data!F479,0)","v":0}]
[null,{"$f":"data!B480","v":"Braga"},{"$f":"CHOOSE(mySelectionType,\nSQRT((data!D480-control!$C$8)^2+(myAspectRatio*(data!E480-control!$C$9))^2)<=control!$C$17,\nAND(data!D480<=control!$C$8,data!E480>=control!$C$9,data!D480>=control!$C$10,data!E480<=control!$C$11))","v":false},{"$f":"IF($C504,data!D480,NA())","v":{"$error":"#N/A"}},{"$f":"IF($C504,data!E480,NA())","v":{"$error":"#N/A"}},{"$f":"IF($C504,data!F480,0)","v":0}]
[null,{"$f":"data!B481","v":"Reykjavík"},{"$f":"CHOOSE(mySelectionType,\nSQRT((data!D481-control!$C$8)^2+(myAspectRatio*(data!E481-control!$C$9))^2)<=control!$C$17,\nAND(data!D481<=control!$C$8,data!E481>=control!$C$9,data!D481>=control!$C$10,data!E481<=control!$C$11))","v":false},{"$f":"IF($C505,data!D481,NA())","v":{"$error":"#N/A"}},{"$f":"IF($C505,data!E481,NA())","v":{"$error":"#N/A"}},{"$f":"IF($C505,data!F481,0)","v":0}]
[null,{"$f":"data!B482","v":"Heilbronn"},{"$f":"CHOOSE(mySelectionType,\nSQRT((data!D482-control!$C$8)^2+(myAspectRatio*(data!E482-control!$C$9))^2)<=control!$C$17,\nAND(data!D482<=control!$C$8,data!E482>=control!$C$9,data!D482>=control!$C$10,data!E482<=control!$C$11))","v":true},{"$f":"IF($C506,data!D482,NA())","v":49.139949999999999},{"$f":"IF($C506,data!E482,NA())","v":9.2205399999999997},{"$f":"IF($C506,data!F482,0)","v":120733}]
[null,{"$f":"data!B483","v":"Ingolstadt"},{"$f":"CHOOSE(mySelectionType,\nSQRT((data!D483-control!$C$8)^2+(myAspectRatio*(data!E483-control!$C$9))^2)<=control!$C$17,\nAND(data!D483<=control!$C$8,data!E483>=control!$C$9,data!D483>=control!$C$10,data!E483<=control!$C$11))","v":true},{"$f":"IF($C507,data!D483,NA())","v":48.765079999999998},{"$f":"IF($C507,data!E483,NA())","v":11.423719999999999},{"$f":"IF($C507,data!F483,0)","v":120658}]
[null,{"$f":"data!B484","v":"Ulm"},{"$f":"CHOOSE(mySelectionType,\nSQRT((data!D484-control!$C$8)^2+(myAspectRatio*(data!E484-control!$C$9))^2)<=control!$C$17,\nAND(data!D484<=control!$C$8,data!E484>=control!$C$9,data!D484>=control!$C$10,data!E484<=control!$C$11))","v":true},{"$f":"IF($C508,data!D484,NA())","v":48.398409999999998},{"$f":"IF($C508,data!E484,NA())","v":9.9915500000000002},{"$f":"IF($C508,data!F484,0)","v":120451}]
[null,{"$f":"data!B485","v":"Karaman"},{"$f":"CHOOSE(mySelectionType,\nSQRT((data!D485-control!$C$8)^2+(myAspectRatio*(data!E485-control!$C$9))^2)<=control!$C$17,\nAND(data!D485<=control!$C$8,data!E485>=control!$C$9,data!D485>=control!$C$10,data!E485<=control!$C$11))","v":false},{"$f":"IF($C509,data!D485,NA())","v":{"$error":"#N/A"}},{"$f":"IF($C509,data!E485,NA())","v":{"$error":"#N/A"}},{"$f":"IF($C509,data!F485,0)","v":0}]
[null,{"$f":"data!B486","v":"Włocławek"},{"$f":"CHOOSE(mySelectionType,\nSQRT((data!D486-control!$C$8)^2+(myAspectRatio*(data!E486-control!$C$9))^2)<=control!$C$17,\nAND(data!D486<=control!$C$8,data!E486>=control!$C$9,data!D486>=control!$C$10,data!E486<=control!$C$11))","v":true},{"$f":"IF($C510,data!D486,NA())","v":52.64817},{"$f":"IF($C510,data!E486,NA())","v":19.067799999999998},{"$f":"IF($C510,data!F486,0)","v":120339}]
[null,{"$f":"data!B487","v":"Perugia"},{"$f":"CHOOSE(mySelectionType,\nSQRT((data!D487-control!$C$8)^2+(myAspectRatio*(data!E487-control!$C$9))^2)<=control!$C$17,\nAND(data!D487<=control!$C$8,data!E487>=control!$C$9,data!D487>=control!$C$10,data!E487<=control!$C$11))","v":true},{"$f":"IF($C511,data!D487,NA())","v":43.112200000000001},{"$f":"IF($C511,data!E487,NA())","v":12.388780000000001},{"$f":"IF($C511,data!F487,0)","v":120137}]
[null,{"$f":"data!B488","v":"Bottrop"},{"$f":"CHOOSE(mySelectionType,\nSQRT((data!D488-control!$C$8)^2+(myAspectRatio*(data!E488-control!$C$9))^2)<=control!$C$17,\nAND(data!D488<=control!$C$8,data!E488>=control!$C$9,data!D488>=control!$C$10,data!E488<=control!$C$11))","v":false},{"$f":"IF($C512,data!D488,NA())","v":{"$error":"#N/A"}},{"$f":"IF($C512,data!E488,NA())","v":{"$error":"#N/A"}},{"$f":"IF($C512,data!F488,0)","v":0}]
[null,{"$f":"data!B489","v":"Leiden"},{"$f":"CHOOSE(mySelectionType,\nSQRT((data!D489-control!$C$8)^2+(myAspectRatio*(data!E489-control!$C$9))^2)<=control!$C$17,\nAND(data!D489<=control!$C$8,data!E489>=control!$C$9,data!D489>=control!$C$10,data!E489<=control!$C$11))","v":false},{"$f":"IF($C513,data!D489,NA())","v":{"$error":"#N/A"}},{"$f":"IF($C513,data!E489,NA())","v":{"$error":"#N/A"}},{"$f":"IF($C513,data!F489,0)","v":0}]
[null,{"$f":"data!B490","v":"Bergedorf"},{"$f":"CHOOSE(mySelectionType,\nSQRT((data!D490-control!$C$8)^2+(myAspectRatio*(data!E490-control!$C$9))^2)<=control!$C$17,\nAND(data!D490<=control!$C$8,data!E490>=control!$C$9,data!D490>=control!$C$10,data!E490<=control!$C$11))","v":true},{"$f":"IF($C514,data!D490,NA())","v":53.48462},{"$f":"IF($C514,data!E490,NA())","v":10.229039999999999},{"$f":"IF($C514,data!F490,0)","v":119665}]
[null,{"$f":"data!B491","v":"Monza"},{"$f":"CHOOSE(mySelectionType,\nSQRT((data!D491-control!$C$8)^2+(myAspectRatio*(data!E491-control!$C$9))^2)<=control!$C$17,\nAND(data!D491<=control!$C$8,data!E491>=control!$C$9,data!D491>=control!$C$10,data!E491<=control!$C$11))","v":true},{"$f":"IF($C515,data!D491,NA())","v":45.58005},{"$f":"IF($C515,data!E491,NA())","v":9.2724600000000006},{"$f":"IF($C515,data!F491,0)","v":119618}]
[null,{"$f":"data!B492","v":"Nazilli"},{"$f":"CHOOSE(mySelectionType,\nSQRT((data!D492-control!$C$8)^2+(myAspectRatio*(data!E492-control!$C$9))^2)<=control!$C$17,\nAND(data!D492<=control!$C$8,data!E492>=control!$C$9,data!D492>=control!$C$10,data!E492<=control!$C$11))","v":false},{"$f":"IF($C516,data!D492,NA())","v":{"$error":"#N/A"}},{"$f":"IF($C516,data!E492,NA())","v":{"$error":"#N/A"}},{"$f":"IF($C516,data!F492,0)","v":0}]
[null,{"$f":"data!B493","v":"Pforzheim"},{"$f":"CHOOSE(mySelectionType,\nSQRT((data!D493-control!$C$8)^2+(myAspectRatio*(data!E493-control!$C$9))^2)<=control!$C$17,\nAND(data!D493<=control!$C$8,data!E493>=control!$C$9,data!D493>=control!$C$10,data!E493<=control!$C$11))","v":true},{"$f":"IF($C517,data!D493,NA())","v":48.884360000000001},{"$f":"IF($C517,data!E493,NA())","v":8.6989199999999993},{"$f":"IF($C517,data!F493,0)","v":119313}]
[null,{"$f":"data!B494","v":"Dordrecht"},{"$f":"CHOOSE(mySelectionType,\nSQRT((data!D494-control!$C$8)^2+(myAspectRatio*(data!E494-control!$C$9))^2)<=control!$C$17,\nAND(data!D494<=control!$C$8,data!E494>=control!$C$9,data!D494>=control!$C$10,data!E494<=control!$C$11))","v":false},{"$f":"IF($C518,data!D494,NA())","v":{"$error":"#N/A"}},{"$f":"IF($C518,data!E494,NA())","v":{"$error":"#N/A"}},{"$f":"IF($C518,data!F494,0)","v":0}]
[null,{"$f":"data!B495","v":"Offenbach"},{"$f":"CHOOSE(mySelectionType,\nSQRT((data!D495-control!$C$8)^2+(myAspectRatio*(data!E495-control!$C$9))^2)<=control!$C$17,\nAND(data!D495<=control!$C$8,data!E495>=control!$C$9,data!D495>=control!$C$10,data!E495<=control!$C$11))","v":true},{"$f":"IF($C519,data!D495,NA())","v":50.100610000000003},{"$f":"IF($C519,data!E495,NA())","v":8.76647},{"$f":"IF($C519,data!F495,0)","v":119192}]
[null,{"$f":"data!B496","v":"Pleven"},{"$f":"CHOOSE(mySelectionType,\nSQRT((data!D496-control!$C$8)^2+(myAspectRatio*(data!E496-control!$C$9))^2)<=control!$C$17,\nAND(data!D496<=control!$C$8,data!E496>=control!$C$9,data!D496>=control!$C$10,data!E496<=control!$C$11))","v":true},{"$f":"IF($C520,data!D496,NA())","v":43.416670000000003},{"$f":"IF($C520,data!E496,NA())","v":24.616669999999999},{"$f":"IF($C520,data!F496,0)","v":118675}]
[null,{"$f":"data!B497","v":"Rimini"},{"$f":"CHOOSE(mySelectionType,\nSQRT((data!D497-control!$C$8)^2+(myAspectRatio*(data!E497-control!$C$9))^2)<=control!$C$17,\nAND(data!D497<=control!$C$8,data!E497>=control!$C$9,data!D497>=control!$C$10,data!E497<=control!$C$11))","v":true},{"$f":"IF($C521,data!D497,NA())","v":44.057549999999999},{"$f":"IF($C521,data!E497,NA())","v":12.56528},{"$f":"IF($C521,data!F497,0)","v":118673}]
[null,{"$f":"data!B498","v":"Zielona Góra"},{"$f":"CHOOSE(mySelectionType,\nSQRT((data!D498-control!$C$8)^2+(myAspectRatio*(data!E498-control!$C$9))^2)<=control!$C$17,\nAND(data!D498<=control!$C$8,data!E498>=control!$C$9,data!D498>=control!$C$10,data!E498<=control!$C$11))","v":true},{"$f":"IF($C522,data!D498,NA())","v":51.935479999999998},{"$f":"IF($C522,data!E498,NA())","v":15.50643},{"$f":"IF($C522,data!F498,0)","v":118433}]
[null,{"$f":"data!B499","v":"Berdyans’k"},{"$f":"CHOOSE(mySelectionType,\nSQRT((data!D499-control!$C$8)^2+(myAspectRatio*(data!E499-control!$C$9))^2)<=control!$C$17,\nAND(data!D499<=control!$C$8,data!E499>=control!$C$9,data!D499>=control!$C$10,data!E499<=control!$C$11))","v":false},{"$f":"IF($C523,data!D499,NA())","v":{"$error":"#N/A"}},{"$f":"IF($C523,data!E499,NA())","v":{"$error":"#N/A"}},{"$f":"IF($C523,data!F499,0)","v":0}]
[null,{"$f":"data!B500","v":"Torrejón de Ardoz"},{"$f":"CHOOSE(mySelectionType,\nSQRT((data!D500-control!$C$8)^2+(myAspectRatio*(data!E500-control!$C$9))^2)<=control!$C$17,\nAND(data!D500<=control!$C$8,data!E500>=control!$C$9,data!D500>=control!$C$10,data!E500<=control!$C$11))","v":false},{"$f":"IF($C524,data!D500,NA())","v":{"$error":"#N/A"}},{"$f":"IF($C524,data!E500,NA())","v":{"$error":"#N/A"}},{"$f":"IF($C524,data!F500,0)","v":0}]
[null,{"$f":"data!B501","v":"Uzhhorod"},{"$f":"CHOOSE(mySelectionType,\nSQRT((data!D501-control!$C$8)^2+(myAspectRatio*(data!E501-control!$C$9))^2)<=control!$C$17,\nAND(data!D501<=control!$C$8,data!E501>=control!$C$9,data!D501>=control!$C$10,data!E501<=control!$C$11))","v":true},{"$f":"IF($C525,data!D501,NA())","v":48.616669999999999},{"$f":"IF($C525,data!E501,NA())","v":22.3},{"$f":"IF($C525,data!F501,0)","v":117878}]
[null,{"$f":"data!B502","v":"Tarnów"},{"$f":"CHOOSE(mySelectionType,\nSQRT((data!D502-control!$C$8)^2+(myAspectRatio*(data!E502-control!$C$9))^2)<=control!$C$17,\nAND(data!D502<=control!$C$8,data!E502>=control!$C$9,data!D502>=control!$C$10,data!E502<=control!$C$11))","v":true},{"$f":"IF($C526,data!D502,NA())","v":50.013809999999999},{"$f":"IF($C526,data!E502,NA())","v":20.986979999999999},{"$f":"IF($C526,data!F502,0)","v":117799}]
[null,{"$f":"data!B503","v":"Rotherham"},{"$f":"CHOOSE(mySelectionType,\nSQRT((data!D503-control!$C$8)^2+(myAspectRatio*(data!E503-control!$C$9))^2)<=control!$C$17,\nAND(data!D503<=control!$C$8,data!E503>=control!$C$9,data!D503>=control!$C$10,data!E503<=control!$C$11))","v":false},{"$f":"IF($C527,data!D503,NA())","v":{"$error":"#N/A"}},{"$f":"IF($C527,data!E503,NA())","v":{"$error":"#N/A"}},{"$f":"IF($C527,data!F503,0)","v":0}]
[null,{"$f":"data!B504","v":"Bremerhaven"},{"$f":"CHOOSE(mySelectionType,\nSQRT((data!D504-control!$C$8)^2+(myAspectRatio*(data!E504-control!$C$9))^2)<=control!$C$17,\nAND(data!D504<=control!$C$8,data!E504>=control!$C$9,data!D504>=control!$C$10,data!E504<=control!$C$11))","v":false},{"$f":"IF($C528,data!D504,NA())","v":{"$error":"#N/A"}},{"$f":"IF($C528,data!E504,NA())","v":{"$error":"#N/A"}},{"$f":"IF($C528,data!F504,0)","v":0}]
[null,{"$f":"data!B505","v":"Panevėžys"},{"$f":"CHOOSE(mySelectionType,\nSQRT((data!D505-control!$C$8)^2+(myAspectRatio*(data!E505-control!$C$9))^2)<=control!$C$17,\nAND(data!D505<=control!$C$8,data!E505>=control!$C$9,data!D505>=control!$C$10,data!E505<=control!$C$11))","v":true},{"$f":"IF($C529,data!D505,NA())","v":55.733330000000002},{"$f":"IF($C529,data!E505,NA())","v":24.35},{"$f":"IF($C529,data!F505,0)","v":117395}]
[null,{"$f":"data!B506","v":"Newport"},{"$f":"CHOOSE(mySelectionType,\nSQRT((data!D506-control!$C$8)^2+(myAspectRatio*(data!E506-control!$C$9))^2)<=control!$C$17,\nAND(data!D506<=control!$C$8,data!E506>=control!$C$9,data!D506>=control!$C$10,data!E506<=control!$C$11))","v":false},{"$f":"IF($C530,data!D506,NA())","v":{"$error":"#N/A"}},{"$f":"IF($C530,data!E506,NA())","v":{"$error":"#N/A"}},{"$f":"IF($C530,data!F506,0)","v":0}]
[null,{"$f":"data!B507","v":"Remscheid"},{"$f":"CHOOSE(mySelectionType,\nSQRT((data!D507-control!$C$8)^2+(myAspectRatio*(data!E507-control!$C$9))^2)<=control!$C$17,\nAND(data!D507<=control!$C$8,data!E507>=control!$C$9,data!D507>=control!$C$10,data!E507<=control!$C$11))","v":false},{"$f":"IF($C531,data!D507,NA())","v":{"$error":"#N/A"}},{"$f":"IF($C531,data!E507,NA())","v":{"$error":"#N/A"}},{"$f":"IF($C531,data!F507,0)","v":0}]
[null,{"$f":"data!B508","v":"Setúbal"},{"$f":"CHOOSE(mySelectionType,\nSQRT((data!D508-control!$C$8)^2+(myAspectRatio*(data!E508-control!$C$9))^2)<=control!$C$17,\nAND(data!D508<=control!$C$8,data!E508>=control!$C$9,data!D508>=control!$C$10,data!E508<=control!$C$11))","v":false},{"$f":"IF($C532,data!D508,NA())","v":{"$error":"#N/A"}},{"$f":"IF($C532,data!E508,NA())","v":{"$error":"#N/A"}},{"$f":"IF($C532,data!F508,0)","v":0}]
[null,{"$f":"data!B509","v":"Čačak"},{"$f":"CHOOSE(mySelectionType,\nSQRT((data!D509-control!$C$8)^2+(myAspectRatio*(data!E509-control!$C$9))^2)<=control!$C$17,\nAND(data!D509<=control!$C$8,data!E509>=control!$C$9,data!D509>=control!$C$10,data!E509<=control!$C$11))","v":true},{"$f":"IF($C533,data!D509,NA())","v":43.891390000000001},{"$f":"IF($C533,data!E509,NA())","v":20.349720000000001},{"$f":"IF($C533,data!F509,0)","v":117072}]
[null,{"$f":"data!B510","v":"Ordu"},{"$f":"CHOOSE(mySelectionType,\nSQRT((data!D510-control!$C$8)^2+(myAspectRatio*(data!E510-control!$C$9))^2)<=control!$C$17,\nAND(data!D510<=control!$C$8,data!E510>=control!$C$9,data!D510>=control!$C$10,data!E510<=control!$C$11))","v":false},{"$f":"IF($C534,data!D510,NA())","v":{"$error":"#N/A"}},{"$f":"IF($C534,data!E510,NA())","v":{"$error":"#N/A"}},{"$f":"IF($C534,data!F510,0)","v":0}]
[null,{"$f":"data!B511","v":"Lausanne"},{"$f":"CHOOSE(mySelectionType,\nSQRT((data!D511-control!$C$8)^2+(myAspectRatio*(data!E511-control!$C$9))^2)<=control!$C$17,\nAND(data!D511<=control!$C$8,data!E511>=control!$C$9,data!D511>=control!$C$10,data!E511<=control!$C$11))","v":false},{"$f":"IF($C535,data!D511,NA())","v":{"$error":"#N/A"}},{"$f":"IF($C535,data!E511,NA())","v":{"$error":"#N/A"}},{"$f":"IF($C535,data!F511,0)","v":0}]
[null,{"$f":"data!B512","v":"Brugge"},{"$f":"CHOOSE(mySelectionType,\nSQRT((data!D512-control!$C$8)^2+(myAspectRatio*(data!E512-control!$C$9))^2)<=control!$C$17,\nAND(data!D512<=control!$C$8,data!E512>=control!$C$9,data!D512>=control!$C$10,data!E512<=control!$C$11))","v":false},{"$f":"IF($C536,data!D512,NA())","v":{"$error":"#N/A"}},{"$f":"IF($C536,data!E512,NA())","v":{"$error":"#N/A"}},{"$f":"IF($C536,data!F512,0)","v":0}]
[null,{"$f":"data!B513","v":"Pescara"},{"$f":"CHOOSE(mySelectionType,\nSQRT((data!D513-control!$C$8)^2+(myAspectRatio*(data!E513-control!$C$9))^2)<=control!$C$17,\nAND(data!D513<=control!$C$8,data!E513>=control!$C$9,data!D513>=control!$C$10,data!E513<=control!$C$11))","v":true},{"$f":"IF($C537,data!D513,NA())","v":42.458399999999997},{"$f":"IF($C537,data!E513,NA())","v":14.202830000000001},{"$f":"IF($C537,data!F513,0)","v":116596}]
[null,{"$f":"data!B514","v":"Jaén"},{"$f":"CHOOSE(mySelectionType,\nSQRT((data!D514-control!$C$8)^2+(myAspectRatio*(data!E514-control!$C$9))^2)<=control!$C$17,\nAND(data!D514<=control!$C$8,data!E514>=control!$C$9,data!D514>=control!$C$10,data!E514<=control!$C$11))","v":false},{"$f":"IF($C538,data!D514,NA())","v":{"$error":"#N/A"}},{"$f":"IF($C538,data!E514,NA())","v":{"$error":"#N/A"}},{"$f":"IF($C538,data!F514,0)","v":0}]
[null,{"$f":"data!B515","v":"Nyíregyháza"},{"$f":"CHOOSE(mySelectionType,\nSQRT((data!D515-control!$C$8)^2+(myAspectRatio*(data!E515-control!$C$9))^2)<=control!$C$17,\nAND(data!D515<=control!$C$8,data!E515>=control!$C$9,data!D515>=control!$C$10,data!E515<=control!$C$11))","v":true},{"$f":"IF($C539,data!D515,NA())","v":47.955390000000001},{"$f":"IF($C539,data!E515,NA())","v":21.716709999999999},{"$f":"IF($C539,data!F515,0)","v":116298}]
[null,{"$f":"data!B516","v":"Algeciras"},{"$f":"CHOOSE(mySelectionType,\nSQRT((data!D516-control!$C$8)^2+(myAspectRatio*(data!E516-control!$C$9))^2)<=control!$C$17,\nAND(data!D516<=control!$C$8,data!E516>=control!$C$9,data!D516>=control!$C$10,data!E516<=control!$C$11))","v":false},{"$f":"IF($C540,data!D516,NA())","v":{"$error":"#N/A"}},{"$f":"IF($C540,data!E516,NA())","v":{"$error":"#N/A"}},{"$f":"IF($C540,data!F516,0)","v":0}]
[null,{"$f":"data!B517","v":"Alchevs’k"},{"$f":"CHOOSE(mySelectionType,\nSQRT((data!D517-control!$C$8)^2+(myAspectRatio*(data!E517-control!$C$9))^2)<=control!$C$17,\nAND(data!D517<=control!$C$8,data!E517>=control!$C$9,data!D517>=control!$C$10,data!E517<=control!$C$11))","v":false},{"$f":"IF($C541,data!D517,NA())","v":{"$error":"#N/A"}},{"$f":"IF($C541,data!E517,NA())","v":{"$error":"#N/A"}},{"$f":"IF($C541,data!F517,0)","v":0}]
[null,{"$f":"data!B518","v":"Pavlohrad"},{"$f":"CHOOSE(mySelectionType,\nSQRT((data!D518-control!$C$8)^2+(myAspectRatio*(data!E518-control!$C$9))^2)<=control!$C$17,\nAND(data!D518<=control!$C$8,data!E518>=control!$C$9,data!D518>=control!$C$10,data!E518<=control!$C$11))","v":false},{"$f":"IF($C542,data!D518,NA())","v":{"$error":"#N/A"}},{"$f":"IF($C542,data!E518,NA())","v":{"$error":"#N/A"}},{"$f":"IF($C542,data!F518,0)","v":0}]
[null,{"$f":"data!B519","v":"Zoetermeer"},{"$f":"CHOOSE(mySelectionType,\nSQRT((data!D519-control!$C$8)^2+(myAspectRatio*(data!E519-control!$C$9))^2)<=control!$C$17,\nAND(data!D519<=control!$C$8,data!E519>=control!$C$9,data!D519>=control!$C$10,data!E519<=control!$C$11))","v":false},{"$f":"IF($C543,data!D519,NA())","v":{"$error":"#N/A"}},{"$f":"IF($C543,data!E519,NA())","v":{"$error":"#N/A"}},{"$f":"IF($C543,data!F519,0)","v":0}]
[null,{"$f":"data!B520","v":"Parla"},{"$f":"CHOOSE(mySelectionType,\nSQRT((data!D520-control!$C$8)^2+(myAspectRatio*(data!E520-control!$C$9))^2)<=control!$C$17,\nAND(data!D520<=control!$C$8,data!E520>=control!$C$9,data!D520>=control!$C$10,data!E520<=control!$C$11))","v":false},{"$f":"IF($C544,data!D520,NA())","v":{"$error":"#N/A"}},{"$f":"IF($C544,data!E520,NA())","v":{"$error":"#N/A"}},{"$f":"IF($C544,data!F520,0)","v":0}]
[null,{"$f":"data!B521","v":"Botoşani"},{"$f":"CHOOSE(mySelectionType,\nSQRT((data!D521-control!$C$8)^2+(myAspectRatio*(data!E521-control!$C$9))^2)<=control!$C$17,\nAND(data!D521<=control!$C$8,data!E521>=control!$C$9,data!D521>=control!$C$10,data!E521<=control!$C$11))","v":true},{"$f":"IF($C545,data!D521,NA())","v":47.75},{"$f":"IF($C545,data!E521,NA())","v":26.66667},{"$f":"IF($C545,data!F521,0)","v":114783}]
[null,{"$f":"data!B522","v":"Bergamo"},{"$f":"CHOOSE(mySelectionType,\nSQRT((data!D522-control!$C$8)^2+(myAspectRatio*(data!E522-control!$C$9))^2)<=control!$C$17,\nAND(data!D522<=control!$C$8,data!E522>=control!$C$9,data!D522>=control!$C$10,data!E522<=control!$C$11))","v":true},{"$f":"IF($C546,data!D522,NA())","v":45.696010000000001},{"$f":"IF($C546,data!E522,NA())","v":9.6672100000000007},{"$f":"IF($C546,data!F522,0)","v":114162}]
[null,{"$f":"data!B523","v":"Erzincan"},{"$f":"CHOOSE(mySelectionType,\nSQRT((data!D523-control!$C$8)^2+(myAspectRatio*(data!E523-control!$C$9))^2)<=control!$C$17,\nAND(data!D523<=control!$C$8,data!E523>=control!$C$9,data!D523>=control!$C$10,data!E523<=control!$C$11))","v":false},{"$f":"IF($C547,data!D523,NA())","v":{"$error":"#N/A"}},{"$f":"IF($C547,data!E523,NA())","v":{"$error":"#N/A"}},{"$f":"IF($C547,data!F523,0)","v":0}]
[null,{"$f":"data!B524","v":"Chorzów"},{"$f":"CHOOSE(mySelectionType,\nSQRT((data!D524-control!$C$8)^2+(myAspectRatio*(data!E524-control!$C$9))^2)<=control!$C$17,\nAND(data!D524<=control!$C$8,data!E524>=control!$C$9,data!D524>=control!$C$10,data!E524<=control!$C$11))","v":true},{"$f":"IF($C548,data!D524,NA())","v":50.305819999999997},{"$f":"IF($C548,data!E524,NA())","v":18.9742},{"$f":"IF($C548,data!F524,0)","v":113430}]
[null,{"$f":"data!B525","v":"Exeter"},{"$f":"CHOOSE(mySelectionType,\nSQRT((data!D525-control!$C$8)^2+(myAspectRatio*(data!E525-control!$C$9))^2)<=control!$C$17,\nAND(data!D525<=control!$C$8,data!E525>=control!$C$9,data!D525>=control!$C$10,data!E525<=control!$C$11))","v":false},{"$f":"IF($C549,data!D525,NA())","v":{"$error":"#N/A"}},{"$f":"IF($C549,data!E525,NA())","v":{"$error":"#N/A"}},{"$f":"IF($C549,data!F525,0)","v":0}]
[null,{"$f":"data!B526","v":"Alanya"},{"$f":"CHOOSE(mySelectionType,\nSQRT((data!D526-control!$C$8)^2+(myAspectRatio*(data!E526-control!$C$9))^2)<=control!$C$17,\nAND(data!D526<=control!$C$8,data!E526>=control!$C$9,data!D526>=control!$C$10,data!E526<=control!$C$11))","v":false},{"$f":"IF($C550,data!D526,NA())","v":{"$error":"#N/A"}},{"$f":"IF($C550,data!E526,NA())","v":{"$error":"#N/A"}},{"$f":"IF($C550,data!F526,0)","v":0}]
[null,{"$f":"data!B527","v":"Eastbourne"},{"$f":"CHOOSE(mySelectionType,\nSQRT((data!D527-control!$C$8)^2+(myAspectRatio*(data!E527-control!$C$9))^2)<=control!$C$17,\nAND(data!D527<=control!$C$8,data!E527>=control!$C$9,data!D527>=control!$C$10,data!E527<=control!$C$11))","v":false},{"$f":"IF($C551,data!D527,NA())","v":{"$error":"#N/A"}},{"$f":"IF($C551,data!E527,NA())","v":{"$error":"#N/A"}},{"$f":"IF($C551,data!F527,0)","v":0}]
[null,{"$f":"data!B528","v":"Rouen"},{"$f":"CHOOSE(mySelectionType,\nSQRT((data!D528-control!$C$8)^2+(myAspectRatio*(data!E528-control!$C$9))^2)<=control!$C$17,\nAND(data!D528<=control!$C$8,data!E528>=control!$C$9,data!D528>=control!$C$10,data!E528<=control!$C$11))","v":false},{"$f":"IF($C552,data!D528,NA())","v":{"$error":"#N/A"}},{"$f":"IF($C552,data!E528,NA())","v":{"$error":"#N/A"}},{"$f":"IF($C552,data!F528,0)","v":0}]
[null,{"$f":"data!B529","v":"Reutlingen"},{"$f":"CHOOSE(mySelectionType,\nSQRT((data!D529-control!$C$8)^2+(myAspectRatio*(data!E529-control!$C$9))^2)<=control!$C$17,\nAND(data!D529<=control!$C$8,data!E529>=control!$C$9,data!D529>=control!$C$10,data!E529<=control!$C$11))","v":true},{"$f":"IF($C553,data!D529,NA())","v":48.491439999999997},{"$f":"IF($C553,data!E529,NA())","v":9.2042699999999993},{"$f":"IF($C553,data!F529,0)","v":112627}]
[null,{"$f":"data!B530","v":"Satu Mare"},{"$f":"CHOOSE(mySelectionType,\nSQRT((data!D530-control!$C$8)^2+(myAspectRatio*(data!E530-control!$C$9))^2)<=control!$C$17,\nAND(data!D530<=control!$C$8,data!E530>=control!$C$9,data!D530>=control!$C$10,data!E530<=control!$C$11))","v":true},{"$f":"IF($C554,data!D530,NA())","v":47.8},{"$f":"IF($C554,data!E530,NA())","v":22.883330000000001},{"$f":"IF($C554,data!F530,0)","v":112490}]
[null,{"$f":"data!B531","v":"Innsbruck"},{"$f":"CHOOSE(mySelectionType,\nSQRT((data!D531-control!$C$8)^2+(myAspectRatio*(data!E531-control!$C$9))^2)<=control!$C$17,\nAND(data!D531<=control!$C$8,data!E531>=control!$C$9,data!D531>=control!$C$10,data!E531<=control!$C$11))","v":true},{"$f":"IF($C555,data!D531,NA())","v":47.262659999999997},{"$f":"IF($C555,data!E531,NA())","v":11.394539999999999},{"$f":"IF($C555,data!F531,0)","v":112467}]
[null,{"$f":"data!B532","v":"Mazyr"},{"$f":"CHOOSE(mySelectionType,\nSQRT((data!D532-control!$C$8)^2+(myAspectRatio*(data!E532-control!$C$9))^2)<=control!$C$17,\nAND(data!D532<=control!$C$8,data!E532>=control!$C$9,data!D532>=control!$C$10,data!E532<=control!$C$11))","v":true},{"$f":"IF($C556,data!D532,NA())","v":52.049500000000002},{"$f":"IF($C556,data!E532,NA())","v":29.2456},{"$f":"IF($C556,data!F532,0)","v":112137}]
[null,{"$f":"data!B533","v":"Fürth"},{"$f":"CHOOSE(mySelectionType,\nSQRT((data!D533-control!$C$8)^2+(myAspectRatio*(data!E533-control!$C$9))^2)<=control!$C$17,\nAND(data!D533<=control!$C$8,data!E533>=control!$C$9,data!D533>=control!$C$10,data!E533<=control!$C$11))","v":true},{"$f":"IF($C557,data!D533,NA())","v":49.475929999999998},{"$f":"IF($C557,data!E533,NA())","v":10.98856},{"$f":"IF($C557,data!F533,0)","v":112025}]
[null,{"$f":"data!B534","v":"Zwolle"},{"$f":"CHOOSE(mySelectionType,\nSQRT((data!D534-control!$C$8)^2+(myAspectRatio*(data!E534-control!$C$9))^2)<=control!$C$17,\nAND(data!D534<=control!$C$8,data!E534>=control!$C$9,data!D534>=control!$C$10,data!E534<=control!$C$11))","v":false},{"$f":"IF($C558,data!D534,NA())","v":{"$error":"#N/A"}},{"$f":"IF($C558,data!E534,NA())","v":{"$error":"#N/A"}},{"$f":"IF($C558,data!F534,0)","v":0}]
[null,{"$f":"data!B535","v":"Lysychans’k"},{"$f":"CHOOSE(mySelectionType,\nSQRT((data!D535-control!$C$8)^2+(myAspectRatio*(data!E535-control!$C$9))^2)<=control!$C$17,\nAND(data!D535<=control!$C$8,data!E535>=control!$C$9,data!D535>=control!$C$10,data!E535<=control!$C$11))","v":false},{"$f":"IF($C559,data!D535,NA())","v":{"$error":"#N/A"}},{"$f":"IF($C559,data!E535,NA())","v":{"$error":"#N/A"}},{"$f":"IF($C559,data!F535,0)","v":0}]
[null,{"$f":"data!B536","v":"Daugavpils"},{"$f":"CHOOSE(mySelectionType,\nSQRT((data!D536-control!$C$8)^2+(myAspectRatio*(data!E536-control!$C$9))^2)<=control!$C$17,\nAND(data!D536<=control!$C$8,data!E536>=control!$C$9,data!D536>=control!$C$10,data!E536<=control!$C$11))","v":true},{"$f":"IF($C560,data!D536,NA())","v":55.883330000000001},{"$f":"IF($C560,data!E536,NA())","v":26.533329999999999},{"$f":"IF($C560,data!F536,0)","v":111564}]
[null,{"$f":"data!B537","v":"Mulhouse"},{"$f":"CHOOSE(mySelectionType,\nSQRT((data!D537-control!$C$8)^2+(myAspectRatio*(data!E537-control!$C$9))^2)<=control!$C$17,\nAND(data!D537<=control!$C$8,data!E537>=control!$C$9,data!D537>=control!$C$10,data!E537<=control!$C$11))","v":false},{"$f":"IF($C561,data!D537,NA())","v":{"$error":"#N/A"}},{"$f":"IF($C561,data!E537,NA())","v":{"$error":"#N/A"}},{"$f":"IF($C561,data!F537,0)","v":0}]
[null,{"$f":"data!B538","v":"Turhal"},{"$f":"CHOOSE(mySelectionType,\nSQRT((data!D538-control!$C$8)^2+(myAspectRatio*(data!E538-control!$C$9))^2)<=control!$C$17,\nAND(data!D538<=control!$C$8,data!E538>=control!$C$9,data!D538>=control!$C$10,data!E538<=control!$C$11))","v":false},{"$f":"IF($C562,data!D538,NA())","v":{"$error":"#N/A"}},{"$f":"IF($C562,data!E538,NA())","v":{"$error":"#N/A"}},{"$f":"IF($C562,data!F538,0)","v":0}]
[null,{"$f":"data!B539","v":"Perpignan"},{"$f":"CHOOSE(mySelectionType,\nSQRT((data!D539-control!$C$8)^2+(myAspectRatio*(data!E539-control!$C$9))^2)<=control!$C$17,\nAND(data!D539<=control!$C$8,data!E539>=control!$C$9,data!D539>=control!$C$10,data!E539<=control!$C$11))","v":false},{"$f":"IF($C563,data!D539,NA())","v":{"$error":"#N/A"}},{"$f":"IF($C563,data!E539,NA())","v":{"$error":"#N/A"}},{"$f":"IF($C563,data!F539,0)","v":0}]
[null,{"$f":"data!B540","v":"Caen"},{"$f":"CHOOSE(mySelectionType,\nSQRT((data!D540-control!$C$8)^2+(myAspectRatio*(data!E540-control!$C$9))^2)<=control!$C$17,\nAND(data!D540<=control!$C$8,data!E540>=control!$C$9,data!D540>=control!$C$10,data!E540<=control!$C$11))","v":false},{"$f":"IF($C564,data!D540,NA())","v":{"$error":"#N/A"}},{"$f":"IF($C564,data!E540,NA())","v":{"$error":"#N/A"}},{"$f":"IF($C564,data!F540,0)","v":0}]
[null,{"$f":"data!B541","v":"Bender"},{"$f":"CHOOSE(mySelectionType,\nSQRT((data!D541-control!$C$8)^2+(myAspectRatio*(data!E541-control!$C$9))^2)<=control!$C$17,\nAND(data!D541<=control!$C$8,data!E541>=control!$C$9,data!D541>=control!$C$10,data!E541<=control!$C$11))","v":true},{"$f":"IF($C565,data!D541,NA())","v":46.830559999999998},{"$f":"IF($C565,data!E541,NA())","v":29.471109999999999},{"$f":"IF($C565,data!F541,0)","v":110175}]
[null,{"$f":"data!B542","v":"Mendip"},{"$f":"CHOOSE(mySelectionType,\nSQRT((data!D542-control!$C$8)^2+(myAspectRatio*(data!E542-control!$C$9))^2)<=control!$C$17,\nAND(data!D542<=control!$C$8,data!E542>=control!$C$9,data!D542>=control!$C$10,data!E542<=control!$C$11))","v":false},{"$f":"IF($C566,data!D542,NA())","v":{"$error":"#N/A"}},{"$f":"IF($C566,data!E542,NA())","v":{"$error":"#N/A"}},{"$f":"IF($C566,data!F542,0)","v":0}]
[null,{"$f":"data!B543","v":"Kecskemét"},{"$f":"CHOOSE(mySelectionType,\nSQRT((data!D543-control!$C$8)^2+(myAspectRatio*(data!E543-control!$C$9))^2)<=control!$C$17,\nAND(data!D543<=control!$C$8,data!E543>=control!$C$9,data!D543>=control!$C$10,data!E543<=control!$C$11))","v":true},{"$f":"IF($C567,data!D543,NA())","v":46.906179999999999},{"$f":"IF($C567,data!E543,NA())","v":19.691279999999999},{"$f":"IF($C567,data!F543,0)","v":109847}]
[null,{"$f":"data!B544","v":"Colchester"},{"$f":"CHOOSE(mySelectionType,\nSQRT((data!D544-control!$C$8)^2+(myAspectRatio*(data!E544-control!$C$9))^2)<=control!$C$17,\nAND(data!D544<=control!$C$8,data!E544>=control!$C$9,data!D544>=control!$C$10,data!E544<=control!$C$11))","v":false},{"$f":"IF($C568,data!D544,NA())","v":{"$error":"#N/A"}},{"$f":"IF($C568,data!E544,NA())","v":{"$error":"#N/A"}},{"$f":"IF($C568,data!F544,0)","v":0}]
[null,{"$f":"data!B545","v":"Kalisz"},{"$f":"CHOOSE(mySelectionType,\nSQRT((data!D545-control!$C$8)^2+(myAspectRatio*(data!E545-control!$C$9))^2)<=control!$C$17,\nAND(data!D545<=control!$C$8,data!E545>=control!$C$9,data!D545>=control!$C$10,data!E545<=control!$C$11))","v":true},{"$f":"IF($C569,data!D545,NA())","v":51.761090000000003},{"$f":"IF($C569,data!E545,NA())","v":18.09102},{"$f":"IF($C569,data!F545,0)","v":108759}]
[null,{"$f":"data!B546","v":"Moers"},{"$f":"CHOOSE(mySelectionType,\nSQRT((data!D546-control!$C$8)^2+(myAspectRatio*(data!E546-control!$C$9))^2)<=control!$C$17,\nAND(data!D546<=control!$C$8,data!E546>=control!$C$9,data!D546>=control!$C$10,data!E546<=control!$C$11))","v":false},{"$f":"IF($C570,data!D546,NA())","v":{"$error":"#N/A"}},{"$f":"IF($C570,data!E546,NA())","v":{"$error":"#N/A"}},{"$f":"IF($C570,data!F546,0)","v":0}]
[null,{"$f":"data!B547","v":"Ourense"},{"$f":"CHOOSE(mySelectionType,\nSQRT((data!D547-control!$C$8)^2+(myAspectRatio*(data!E547-control!$C$9))^2)<=control!$C$17,\nAND(data!D547<=control!$C$8,data!E547>=control!$C$9,data!D547>=control!$C$10,data!E547<=control!$C$11))","v":false},{"$f":"IF($C571,data!D547,NA())","v":{"$error":"#N/A"}},{"$f":"IF($C571,data!E547,NA())","v":{"$error":"#N/A"}},{"$f":"IF($C571,data!F547,0)","v":0}]
[null,{"$f":"data!B548","v":"Bandırma"},{"$f":"CHOOSE(mySelectionType,\nSQRT((data!D548-control!$C$8)^2+(myAspectRatio*(data!E548-control!$C$9))^2)<=control!$C$17,\nAND(data!D548<=control!$C$8,data!E548>=control!$C$9,data!D548>=control!$C$10,data!E548<=control!$C$11))","v":true},{"$f":"IF($C572,data!D548,NA())","v":40.352220000000003},{"$f":"IF($C572,data!E548,NA())","v":27.976669999999999},{"$f":"IF($C572,data!F548,0)","v":107631}]
[null,{"$f":"data!B549","v":"Râmnicu Vâlcea"},{"$f":"CHOOSE(mySelectionType,\nSQRT((data!D549-control!$C$8)^2+(myAspectRatio*(data!E549-control!$C$9))^2)<=control!$C$17,\nAND(data!D549<=control!$C$8,data!E549>=control!$C$9,data!D549>=control!$C$10,data!E549<=control!$C$11))","v":true},{"$f":"IF($C573,data!D549,NA())","v":45.1},{"$f":"IF($C573,data!E549,NA())","v":24.366669999999999},{"$f":"IF($C573,data!F549,0)","v":107558}]
[null,{"$f":"data!B550","v":"Alcobendas"},{"$f":"CHOOSE(mySelectionType,\nSQRT((data!D550-control!$C$8)^2+(myAspectRatio*(data!E550-control!$C$9))^2)<=control!$C$17,\nAND(data!D550<=control!$C$8,data!E550>=control!$C$9,data!D550>=control!$C$10,data!E550<=control!$C$11))","v":false},{"$f":"IF($C574,data!D550,NA())","v":{"$error":"#N/A"}},{"$f":"IF($C574,data!E550,NA())","v":{"$error":"#N/A"}},{"$f":"IF($C574,data!F550,0)","v":0}]
[null,{"$f":"data!B551","v":"Koszalin"},{"$f":"CHOOSE(mySelectionType,\nSQRT((data!D551-control!$C$8)^2+(myAspectRatio*(data!E551-control!$C$9))^2)<=control!$C$17,\nAND(data!D551<=control!$C$8,data!E551>=control!$C$9,data!D551>=control!$C$10,data!E551<=control!$C$11))","v":true},{"$f":"IF($C575,data!D551,NA())","v":54.194380000000002},{"$f":"IF($C575,data!E551,NA())","v":16.172219999999999},{"$f":"IF($C575,data!F551,0)","v":107450}]
[null,{"$f":"data!B552","v":"Koblenz"},{"$f":"CHOOSE(mySelectionType,\nSQRT((data!D552-control!$C$8)^2+(myAspectRatio*(data!E552-control!$C$9))^2)<=control!$C$17,\nAND(data!D552<=control!$C$8,data!E552>=control!$C$9,data!D552>=control!$C$10,data!E552<=control!$C$11))","v":false},{"$f":"IF($C576,data!D552,NA())","v":{"$error":"#N/A"}},{"$f":"IF($C576,data!E552,NA())","v":{"$error":"#N/A"}},{"$f":"IF($C576,data!F552,0)","v":0}]
[null,{"$f":"data!B553","v":"Siegen"},{"$f":"CHOOSE(mySelectionType,\nSQRT((data!D553-control!$C$8)^2+(myAspectRatio*(data!E553-control!$C$9))^2)<=control!$C$17,\nAND(data!D553<=control!$C$8,data!E553>=control!$C$9,data!D553>=control!$C$10,data!E553<=control!$C$11))","v":true},{"$f":"IF($C577,data!D553,NA())","v":50.874809999999997},{"$f":"IF($C577,data!E553,NA())","v":8.0243099999999998},{"$f":"IF($C577,data!F553,0)","v":107242}]
[null,{"$f":"data!B554","v":"Västerås"},{"$f":"CHOOSE(mySelectionType,\nSQRT((data!D554-control!$C$8)^2+(myAspectRatio*(data!E554-control!$C$9))^2)<=control!$C$17,\nAND(data!D554<=control!$C$8,data!E554>=control!$C$9,data!D554>=control!$C$10,data!E554<=control!$C$11))","v":true},{"$f":"IF($C578,data!D554,NA())","v":59.616169999999997},{"$f":"IF($C578,data!E554,NA())","v":16.552759999999999},{"$f":"IF($C578,data!F554,0)","v":107194}]
[null,{"$f":"data!B555","v":"Vicenza"},{"$f":"CHOOSE(mySelectionType,\nSQRT((data!D555-control!$C$8)^2+(myAspectRatio*(data!E555-control!$C$9))^2)<=control!$C$17,\nAND(data!D555<=control!$C$8,data!E555>=control!$C$9,data!D555>=control!$C$10,data!E555<=control!$C$11))","v":true},{"$f":"IF($C579,data!D555,NA())","v":45.546720000000001},{"$f":"IF($C579,data!E555,NA())","v":11.547499999999999},{"$f":"IF($C579,data!F555,0)","v":107129}]
[null,{"$f":"data!B556","v":"Reus"},{"$f":"CHOOSE(mySelectionType,\nSQRT((data!D556-control!$C$8)^2+(myAspectRatio*(data!E556-control!$C$9))^2)<=control!$C$17,\nAND(data!D556<=control!$C$8,data!E556>=control!$C$9,data!D556>=control!$C$10,data!E556<=control!$C$11))","v":false},{"$f":"IF($C580,data!D556,NA())","v":{"$error":"#N/A"}},{"$f":"IF($C580,data!E556,NA())","v":{"$error":"#N/A"}},{"$f":"IF($C580,data!F556,0)","v":0}]
[null,{"$f":"data!B557","v":"Crawley"},{"$f":"CHOOSE(mySelectionType,\nSQRT((data!D557-control!$C$8)^2+(myAspectRatio*(data!E557-control!$C$9))^2)<=control!$C$17,\nAND(data!D557<=control!$C$8,data!E557>=control!$C$9,data!D557>=control!$C$10,data!E557<=control!$C$11))","v":false},{"$f":"IF($C581,data!D557,NA())","v":{"$error":"#N/A"}},{"$f":"IF($C581,data!E557,NA())","v":{"$error":"#N/A"}},{"$f":"IF($C581,data!F557,0)","v":0}]
[null,{"$f":"data!B558","v":"Mitrovicë"},{"$f":"CHOOSE(mySelectionType,\nSQRT((data!D558-control!$C$8)^2+(myAspectRatio*(data!E558-control!$C$9))^2)<=control!$C$17,\nAND(data!D558<=control!$C$8,data!E558>=control!$C$9,data!D558>=control!$C$10,data!E558<=control!$C$11))","v":true},{"$f":"IF($C582,data!D558,NA())","v":42.883330000000001},{"$f":"IF($C582,data!E558,NA())","v":20.866669999999999},{"$f":"IF($C582,data!F558,0)","v":107045}]
[null,{"$f":"data!B559","v":"Sutton Coldfield"},{"$f":"CHOOSE(mySelectionType,\nSQRT((data!D559-control!$C$8)^2+(myAspectRatio*(data!E559-control!$C$9))^2)<=control!$C$17,\nAND(data!D559<=control!$C$8,data!E559>=control!$C$9,data!D559>=control!$C$10,data!E559<=control!$C$11))","v":false},{"$f":"IF($C583,data!D559,NA())","v":{"$error":"#N/A"}},{"$f":"IF($C583,data!E559,NA())","v":{"$error":"#N/A"}},{"$f":"IF($C583,data!F559,0)","v":0}]
[null,{"$f":"data!B560","v":"Coimbra"},{"$f":"CHOOSE(mySelectionType,\nSQRT((data!D560-control!$C$8)^2+(myAspectRatio*(data!E560-control!$C$9))^2)<=control!$C$17,\nAND(data!D560<=control!$C$8,data!E560>=control!$C$9,data!D560>=control!$C$10,data!E560<=control!$C$11))","v":false},{"$f":"IF($C584,data!D560,NA())","v":{"$error":"#N/A"}},{"$f":"IF($C584,data!E560,NA())","v":{"$error":"#N/A"}},{"$f":"IF($C584,data!F560,0)","v":0}]
[null,{"$f":"data!B561","v":"Namur"},{"$f":"CHOOSE(mySelectionType,\nSQRT((data!D561-control!$C$8)^2+(myAspectRatio*(data!E561-control!$C$9))^2)<=control!$C$17,\nAND(data!D561<=control!$C$8,data!E561>=control!$C$9,data!D561>=control!$C$10,data!E561<=control!$C$11))","v":false},{"$f":"IF($C585,data!D561,NA())","v":{"$error":"#N/A"}},{"$f":"IF($C585,data!E561,NA())","v":{"$error":"#N/A"}},{"$f":"IF($C585,data!F561,0)","v":0}]
[null,{"$f":"data!B562","v":"Bergisch Gladbach"},{"$f":"CHOOSE(mySelectionType,\nSQRT((data!D562-control!$C$8)^2+(myAspectRatio*(data!E562-control!$C$9))^2)<=control!$C$17,\nAND(data!D562<=control!$C$8,data!E562>=control!$C$9,data!D562>=control!$C$10,data!E562<=control!$C$11))","v":false},{"$f":"IF($C586,data!D562,NA())","v":{"$error":"#N/A"}},{"$f":"IF($C586,data!E562,NA())","v":{"$error":"#N/A"}},{"$f":"IF($C586,data!F562,0)","v":0}]
[null,{"$f":"data!B563","v":"Blackburn"},{"$f":"CHOOSE(mySelectionType,\nSQRT((data!D563-control!$C$8)^2+(myAspectRatio*(data!E563-control!$C$9))^2)<=control!$C$17,\nAND(data!D563<=control!$C$8,data!E563>=control!$C$9,data!D563>=control!$C$10,data!E563<=control!$C$11))","v":false},{"$f":"IF($C587,data!D563,NA())","v":{"$error":"#N/A"}},{"$f":"IF($C587,data!E563,NA())","v":{"$error":"#N/A"}},{"$f":"IF($C587,data!F563,0)","v":0}]
[null,{"$f":"data!B564","v":"Legnica"},{"$f":"CHOOSE(mySelectionType,\nSQRT((data!D564-control!$C$8)^2+(myAspectRatio*(data!E564-control!$C$9))^2)<=control!$C$17,\nAND(data!D564<=control!$C$8,data!E564>=control!$C$9,data!D564>=control!$C$10,data!E564<=control!$C$11))","v":true},{"$f":"IF($C588,data!D564,NA())","v":51.210059999999999},{"$f":"IF($C588,data!E564,NA())","v":16.161899999999999},{"$f":"IF($C588,data!F564,0)","v":106033}]
[null,{"$f":"data!B565","v":"Suceava"},{"$f":"CHOOSE(mySelectionType,\nSQRT((data!D565-control!$C$8)^2+(myAspectRatio*(data!E565-control!$C$9))^2)<=control!$C$17,\nAND(data!D565<=control!$C$8,data!E565>=control!$C$9,data!D565>=control!$C$10,data!E565<=control!$C$11))","v":true},{"$f":"IF($C589,data!D565,NA())","v":47.633330000000001},{"$f":"IF($C589,data!E565,NA())","v":26.25},{"$f":"IF($C589,data!F565,0)","v":105796}]
[null,{"$f":"data!B566","v":"Nancy"},{"$f":"CHOOSE(mySelectionType,\nSQRT((data!D566-control!$C$8)^2+(myAspectRatio*(data!E566-control!$C$9))^2)<=control!$C$17,\nAND(data!D566<=control!$C$8,data!E566>=control!$C$9,data!D566>=control!$C$10,data!E566<=control!$C$11))","v":false},{"$f":"IF($C590,data!D566,NA())","v":{"$error":"#N/A"}},{"$f":"IF($C590,data!E566,NA())","v":{"$error":"#N/A"}},{"$f":"IF($C590,data!F566,0)","v":0}]
[null,{"$f":"data!B567","v":"Yevpatoriya"},{"$f":"CHOOSE(mySelectionType,\nSQRT((data!D567-control!$C$8)^2+(myAspectRatio*(data!E567-control!$C$9))^2)<=control!$C$17,\nAND(data!D567<=control!$C$8,data!E567>=control!$C$9,data!D567>=control!$C$10,data!E567<=control!$C$11))","v":true},{"$f":"IF($C591,data!D567,NA())","v":45.20091},{"$f":"IF($C591,data!E567,NA())","v":33.366549999999997},{"$f":"IF($C591,data!F567,0)","v":105223}]
[null,{"$f":"data!B568","v":"Focşani"},{"$f":"CHOOSE(mySelectionType,\nSQRT((data!D568-control!$C$8)^2+(myAspectRatio*(data!E568-control!$C$9))^2)<=control!$C$17,\nAND(data!D568<=control!$C$8,data!E568>=control!$C$9,data!D568>=control!$C$10,data!E568<=control!$C$11))","v":true},{"$f":"IF($C592,data!D568,NA())","v":45.7},{"$f":"IF($C592,data!E568,NA())","v":27.183330000000002},{"$f":"IF($C592,data!F568,0)","v":105112}]
[null,{"$f":"data!B569","v":"Oldham"},{"$f":"CHOOSE(mySelectionType,\nSQRT((data!D569-control!$C$8)^2+(myAspectRatio*(data!E569-control!$C$9))^2)<=control!$C$17,\nAND(data!D569<=control!$C$8,data!E569>=control!$C$9,data!D569>=control!$C$10,data!E569<=control!$C$11))","v":false},{"$f":"IF($C593,data!D569,NA())","v":{"$error":"#N/A"}},{"$f":"IF($C593,data!E569,NA())","v":{"$error":"#N/A"}},{"$f":"IF($C593,data!F569,0)","v":0}]
[null,{"$f":"data!B570","v":"Jena"},{"$f":"CHOOSE(mySelectionType,\nSQRT((data!D570-control!$C$8)^2+(myAspectRatio*(data!E570-control!$C$9))^2)<=control!$C$17,\nAND(data!D570<=control!$C$8,data!E570>=control!$C$9,data!D570>=control!$C$10,data!E570<=control!$C$11))","v":true},{"$f":"IF($C594,data!D570,NA())","v":50.928780000000003},{"$f":"IF($C594,data!E570,NA())","v":11.5899},{"$f":"IF($C594,data!F570,0)","v":104712}]
[null,{"$f":"data!B571","v":"Gera"},{"$f":"CHOOSE(mySelectionType,\nSQRT((data!D571-control!$C$8)^2+(myAspectRatio*(data!E571-control!$C$9))^2)<=control!$C$17,\nAND(data!D571<=control!$C$8,data!E571>=control!$C$9,data!D571>=control!$C$10,data!E571<=control!$C$11))","v":true},{"$f":"IF($C595,data!D571,NA())","v":50.880290000000002},{"$f":"IF($C595,data!E571,NA())","v":12.08187},{"$f":"IF($C595,data!F571,0)","v":104659}]
[null,{"$f":"data!B572","v":"Mostar"},{"$f":"CHOOSE(mySelectionType,\nSQRT((data!D572-control!$C$8)^2+(myAspectRatio*(data!E572-control!$C$9))^2)<=control!$C$17,\nAND(data!D572<=control!$C$8,data!E572>=control!$C$9,data!D572>=control!$C$10,data!E572<=control!$C$11))","v":true},{"$f":"IF($C596,data!D572,NA())","v":43.343330000000002},{"$f":"IF($C596,data!E572,NA())","v":17.808060000000001},{"$f":"IF($C596,data!F572,0)","v":104518}]
[null,{"$f":"data!B573","v":"Yenakiyeve"},{"$f":"CHOOSE(mySelectionType,\nSQRT((data!D573-control!$C$8)^2+(myAspectRatio*(data!E573-control!$C$9))^2)<=control!$C$17,\nAND(data!D573<=control!$C$8,data!E573>=control!$C$9,data!D573>=control!$C$10,data!E573<=control!$C$11))","v":false},{"$f":"IF($C597,data!D573,NA())","v":{"$error":"#N/A"}},{"$f":"IF($C597,data!E573,NA())","v":{"$error":"#N/A"}},{"$f":"IF($C597,data!F573,0)","v":0}]
[null,{"$f":"data!B574","v":"Woking"},{"$f":"CHOOSE(mySelectionType,\nSQRT((data!D574-control!$C$8)^2+(myAspectRatio*(data!E574-control!$C$9))^2)<=control!$C$17,\nAND(data!D574<=control!$C$8,data!E574>=control!$C$9,data!D574>=control!$C$10,data!E574<=control!$C$11))","v":false},{"$f":"IF($C598,data!D574,NA())","v":{"$error":"#N/A"}},{"$f":"IF($C598,data!E574,NA())","v":{"$error":"#N/A"}},{"$f":"IF($C598,data!F574,0)","v":0}]
[null,{"$f":"data!B575","v":"Queluz"},{"$f":"CHOOSE(mySelectionType,\nSQRT((data!D575-control!$C$8)^2+(myAspectRatio*(data!E575-control!$C$9))^2)<=control!$C$17,\nAND(data!D575<=control!$C$8,data!E575>=control!$C$9,data!D575>=control!$C$10,data!E575<=control!$C$11))","v":false},{"$f":"IF($C599,data!D575,NA())","v":{"$error":"#N/A"}},{"$f":"IF($C599,data!E575,NA())","v":{"$error":"#N/A"}},{"$f":"IF($C599,data!F575,0)","v":0}]
[null,{"$f":"data!B576","v":"Turgutlu"},{"$f":"CHOOSE(mySelectionType,\nSQRT((data!D576-control!$C$8)^2+(myAspectRatio*(data!E576-control!$C$9))^2)<=control!$C$17,\nAND(data!D576<=control!$C$8,data!E576>=control!$C$9,data!D576>=control!$C$10,data!E576<=control!$C$11))","v":false},{"$f":"IF($C600,data!D576,NA())","v":{"$error":"#N/A"}},{"$f":"IF($C600,data!E576,NA())","v":{"$error":"#N/A"}},{"$f":"IF($C600,data!F576,0)","v":0}]
[null,{"$f":"data!B577","v":"Cheltenham"},{"$f":"CHOOSE(mySelectionType,\nSQRT((data!D577-control!$C$8)^2+(myAspectRatio*(data!E577-control!$C$9))^2)<=control!$C$17,\nAND(data!D577<=control!$C$8,data!E577>=control!$C$9,data!D577>=control!$C$10,data!E577<=control!$C$11))","v":false},{"$f":"IF($C601,data!D577,NA())","v":{"$error":"#N/A"}},{"$f":"IF($C601,data!E577,NA())","v":{"$error":"#N/A"}},{"$f":"IF($C601,data!F577,0)","v":0}]
[null,{"$f":"data!B578","v":"Hildesheim"},{"$f":"CHOOSE(mySelectionType,\nSQRT((data!D578-control!$C$8)^2+(myAspectRatio*(data!E578-control!$C$9))^2)<=control!$C$17,\nAND(data!D578<=control!$C$8,data!E578>=control!$C$9,data!D578>=control!$C$10,data!E578<=control!$C$11))","v":true},{"$f":"IF($C602,data!D578,NA())","v":52.150770000000001},{"$f":"IF($C602,data!E578,NA())","v":9.9511199999999995},{"$f":"IF($C602,data!F578,0)","v":103052}]
[null,{"$f":"data!B579","v":"Oleksandriya"},{"$f":"CHOOSE(mySelectionType,\nSQRT((data!D579-control!$C$8)^2+(myAspectRatio*(data!E579-control!$C$9))^2)<=control!$C$17,\nAND(data!D579<=control!$C$8,data!E579>=control!$C$9,data!D579>=control!$C$10,data!E579<=control!$C$11))","v":true},{"$f":"IF($C603,data!D579,NA())","v":48.669609999999999},{"$f":"IF($C603,data!E579,NA())","v":33.115929999999999},{"$f":"IF($C603,data!F579,0)","v":103000}]
[null,{"$f":"data!B580","v":"Piatra Neamţ"},{"$f":"CHOOSE(mySelectionType,\nSQRT((data!D580-control!$C$8)^2+(myAspectRatio*(data!E580-control!$C$9))^2)<=control!$C$17,\nAND(data!D580<=control!$C$8,data!E580>=control!$C$9,data!D580>=control!$C$10,data!E580<=control!$C$11))","v":true},{"$f":"IF($C604,data!D580,NA())","v":46.916670000000003},{"$f":"IF($C604,data!E580,NA())","v":26.33333},{"$f":"IF($C604,data!F580,0)","v":102688}]
[null,{"$f":"data!B581","v":"Erlangen"},{"$f":"CHOOSE(mySelectionType,\nSQRT((data!D581-control!$C$8)^2+(myAspectRatio*(data!E581-control!$C$9))^2)<=control!$C$17,\nAND(data!D581<=control!$C$8,data!E581>=control!$C$9,data!D581>=control!$C$10,data!E581<=control!$C$11))","v":true},{"$f":"IF($C605,data!D581,NA())","v":49.590989999999998},{"$f":"IF($C605,data!E581,NA())","v":11.00783},{"$f":"IF($C605,data!F581,0)","v":102675}]
[null,{"$f":"data!B582","v":"Chelmsford"},{"$f":"CHOOSE(mySelectionType,\nSQRT((data!D582-control!$C$8)^2+(myAspectRatio*(data!E582-control!$C$9))^2)<=control!$C$17,\nAND(data!D582<=control!$C$8,data!E582>=control!$C$9,data!D582>=control!$C$10,data!E582<=control!$C$11))","v":false},{"$f":"IF($C606,data!D582,NA())","v":{"$error":"#N/A"}},{"$f":"IF($C606,data!E582,NA())","v":{"$error":"#N/A"}},{"$f":"IF($C606,data!F582,0)","v":0}]
[null,{"$f":"data!B583","v":"St Helens"},{"$f":"CHOOSE(mySelectionType,\nSQRT((data!D583-control!$C$8)^2+(myAspectRatio*(data!E583-control!$C$9))^2)<=control!$C$17,\nAND(data!D583<=control!$C$8,data!E583>=control!$C$9,data!D583>=control!$C$10,data!E583<=control!$C$11))","v":false},{"$f":"IF($C607,data!D583,NA())","v":{"$error":"#N/A"}},{"$f":"IF($C607,data!E583,NA())","v":{"$error":"#N/A"}},{"$f":"IF($C607,data!F583,0)","v":0}]
[null,{"$f":"data!B584","v":"Drobeta-Turnu Severin"},{"$f":"CHOOSE(mySelectionType,\nSQRT((data!D584-control!$C$8)^2+(myAspectRatio*(data!E584-control!$C$9))^2)<=control!$C$17,\nAND(data!D584<=control!$C$8,data!E584>=control!$C$9,data!D584>=control!$C$10,data!E584<=control!$C$11))","v":true},{"$f":"IF($C608,data!D584,NA())","v":44.63194},{"$f":"IF($C608,data!E584,NA())","v":22.656110000000002},{"$f":"IF($C608,data!F584,0)","v":102346}]
[null,{"$f":"data!B585","v":"Torrevieja"},{"$f":"CHOOSE(mySelectionType,\nSQRT((data!D585-control!$C$8)^2+(myAspectRatio*(data!E585-control!$C$9))^2)<=control!$C$17,\nAND(data!D585<=control!$C$8,data!E585>=control!$C$9,data!D585>=control!$C$10,data!E585<=control!$C$11))","v":false},{"$f":"IF($C609,data!D585,NA())","v":{"$error":"#N/A"}},{"$f":"IF($C609,data!E585,NA())","v":{"$error":"#N/A"}},{"$f":"IF($C609,data!F585,0)","v":0}]
[null,{"$f":"data!B586","v":"Salihorsk"},{"$f":"CHOOSE(mySelectionType,\nSQRT((data!D586-control!$C$8)^2+(myAspectRatio*(data!E586-control!$C$9))^2)<=control!$C$17,\nAND(data!D586<=control!$C$8,data!E586>=control!$C$9,data!D586>=control!$C$10,data!E586<=control!$C$11))","v":true},{"$f":"IF($C610,data!D586,NA())","v":52.787599999999998},{"$f":"IF($C610,data!E586,NA())","v":27.541499999999999},{"$f":"IF($C610,data!F586,0)","v":101614}]
[null,{"$f":"data!B587","v":"Székesfehérvár"},{"$f":"CHOOSE(mySelectionType,\nSQRT((data!D587-control!$C$8)^2+(myAspectRatio*(data!E587-control!$C$9))^2)<=control!$C$17,\nAND(data!D587<=control!$C$8,data!E587>=control!$C$9,data!D587>=control!$C$10,data!E587<=control!$C$11))","v":true},{"$f":"IF($C611,data!D587,NA())","v":47.189950000000003},{"$f":"IF($C611,data!E587,NA())","v":18.410340000000001},{"$f":"IF($C611,data!F587,0)","v":101600}]
[null,{"$f":"data!B588","v":"Argenteuil"},{"$f":"CHOOSE(mySelectionType,\nSQRT((data!D588-control!$C$8)^2+(myAspectRatio*(data!E588-control!$C$9))^2)<=control!$C$17,\nAND(data!D588<=control!$C$8,data!E588>=control!$C$9,data!D588>=control!$C$10,data!E588<=control!$C$11))","v":false},{"$f":"IF($C612,data!D588,NA())","v":{"$error":"#N/A"}},{"$f":"IF($C612,data!E588,NA())","v":{"$error":"#N/A"}},{"$f":"IF($C612,data!F588,0)","v":0}]
[null,{"$f":"data!B589","v":"Mustafakemalpaşa"},{"$f":"CHOOSE(mySelectionType,\nSQRT((data!D589-control!$C$8)^2+(myAspectRatio*(data!E589-control!$C$9))^2)<=control!$C$17,\nAND(data!D589<=control!$C$8,data!E589>=control!$C$9,data!D589>=control!$C$10,data!E589<=control!$C$11))","v":true},{"$f":"IF($C613,data!D589,NA())","v":40.038150000000002},{"$f":"IF($C613,data!E589,NA())","v":28.408660000000001},{"$f":"IF($C613,data!F589,0)","v":101412}]
[null,{"$f":"data!B590","v":"Basildon"},{"$f":"CHOOSE(mySelectionType,\nSQRT((data!D590-control!$C$8)^2+(myAspectRatio*(data!E590-control!$C$9))^2)<=control!$C$17,\nAND(data!D590<=control!$C$8,data!E590>=control!$C$9,data!D590>=control!$C$10,data!E590<=control!$C$11))","v":false},{"$f":"IF($C614,data!D590,NA())","v":{"$error":"#N/A"}},{"$f":"IF($C614,data!E590,NA())","v":{"$error":"#N/A"}},{"$f":"IF($C614,data!F590,0)","v":0}]
[null,{"$f":"data!B591","v":"Maladzyechna"},{"$f":"CHOOSE(mySelectionType,\nSQRT((data!D591-control!$C$8)^2+(myAspectRatio*(data!E591-control!$C$9))^2)<=control!$C$17,\nAND(data!D591<=control!$C$8,data!E591>=control!$C$9,data!D591>=control!$C$10,data!E591<=control!$C$11))","v":true},{"$f":"IF($C615,data!D591,NA())","v":54.316699999999997},{"$f":"IF($C615,data!E591,NA())","v":26.853999999999999},{"$f":"IF($C615,data!F591,0)","v":101300}]
[null,{"$f":"data!B592","v":"Olomouc"},{"$f":"CHOOSE(mySelectionType,\nSQRT((data!D592-control!$C$8)^2+(myAspectRatio*(data!E592-control!$C$9))^2)<=control!$C$17,\nAND(data!D592<=control!$C$8,data!E592>=control!$C$9,data!D592>=control!$C$10,data!E592<=control!$C$11))","v":true},{"$f":"IF($C616,data!D592,NA())","v":49.59552},{"$f":"IF($C616,data!E592,NA())","v":17.251750000000001},{"$f":"IF($C616,data!F592,0)","v":101268}]
[null,{"$f":"data!B593","v":"Witten"},{"$f":"CHOOSE(mySelectionType,\nSQRT((data!D593-control!$C$8)^2+(myAspectRatio*(data!E593-control!$C$9))^2)<=control!$C$17,\nAND(data!D593<=control!$C$8,data!E593>=control!$C$9,data!D593>=control!$C$10,data!E593<=control!$C$11))","v":false},{"$f":"IF($C617,data!D593,NA())","v":{"$error":"#N/A"}},{"$f":"IF($C617,data!E593,NA())","v":{"$error":"#N/A"}},{"$f":"IF($C617,data!F593,0)","v":0}]
[null,{"$f":"data!B594","v":"Gillingham"},{"$f":"CHOOSE(mySelectionType,\nSQRT((data!D594-control!$C$8)^2+(myAspectRatio*(data!E594-control!$C$9))^2)<=control!$C$17,\nAND(data!D594<=control!$C$8,data!E594>=control!$C$9,data!D594>=control!$C$10,data!E594<=control!$C$11))","v":false},{"$f":"IF($C618,data!D594,NA())","v":{"$error":"#N/A"}},{"$f":"IF($C618,data!E594,NA())","v":{"$error":"#N/A"}},{"$f":"IF($C618,data!F594,0)","v":0}]
[null,{"$f":"data!B595","v":"Tartu"},{"$f":"CHOOSE(mySelectionType,\nSQRT((data!D595-control!$C$8)^2+(myAspectRatio*(data!E595-control!$C$9))^2)<=control!$C$17,\nAND(data!D595<=control!$C$8,data!E595>=control!$C$9,data!D595>=control!$C$10,data!E595<=control!$C$11))","v":true},{"$f":"IF($C619,data!D595,NA())","v":58.38062},{"$f":"IF($C619,data!E595,NA())","v":26.725090000000002},{"$f":"IF($C619,data!F595,0)","v":101092}]
[null,{"$f":"data!B596","v":"Elbasan"},{"$f":"CHOOSE(mySelectionType,\nSQRT((data!D596-control!$C$8)^2+(myAspectRatio*(data!E596-control!$C$9))^2)<=control!$C$17,\nAND(data!D596<=control!$C$8,data!E596>=control!$C$9,data!D596>=control!$C$10,data!E596<=control!$C$11))","v":true},{"$f":"IF($C620,data!D596,NA())","v":41.112499999999997},{"$f":"IF($C620,data!E596,NA())","v":20.08222},{"$f":"IF($C620,data!F596,0)","v":100903}]
[null,{"$f":"data!B597","v":"Navapolatsk"},{"$f":"CHOOSE(mySelectionType,\nSQRT((data!D597-control!$C$8)^2+(myAspectRatio*(data!E597-control!$C$9))^2)<=control!$C$17,\nAND(data!D597<=control!$C$8,data!E597>=control!$C$9,data!D597>=control!$C$10,data!E597<=control!$C$11))","v":true},{"$f":"IF($C621,data!D597,NA())","v":55.531799999999997},{"$f":"IF($C621,data!E597,NA())","v":28.598700000000001},{"$f":"IF($C621,data!F597,0)","v":100885}]
[null,{"$f":"data!B598","v":"Kallithéa"},{"$f":"CHOOSE(mySelectionType,\nSQRT((data!D598-control!$C$8)^2+(myAspectRatio*(data!E598-control!$C$9))^2)<=control!$C$17,\nAND(data!D598<=control!$C$8,data!E598>=control!$C$9,data!D598>=control!$C$10,data!E598<=control!$C$11))","v":true},{"$f":"IF($C622,data!D598,NA())","v":37.950000000000003},{"$f":"IF($C622,data!E598,NA())","v":23.7},{"$f":"IF($C622,data!F598,0)","v":100641}]
[null,{"$f":"data!B599","v":"Zonguldak"},{"$f":"CHOOSE(mySelectionType,\nSQRT((data!D599-control!$C$8)^2+(myAspectRatio*(data!E599-control!$C$9))^2)<=control!$C$17,\nAND(data!D599<=control!$C$8,data!E599>=control!$C$9,data!D599>=control!$C$10,data!E599<=control!$C$11))","v":true},{"$f":"IF($C623,data!D599,NA())","v":41.451390000000004},{"$f":"IF($C623,data!E599,NA())","v":31.793050000000001},{"$f":"IF($C623,data!F599,0)","v":100229}]
[null,{"$f":"data!B600","v":"Trier"},{"$f":"CHOOSE(mySelectionType,\nSQRT((data!D600-control!$C$8)^2+(myAspectRatio*(data!E600-control!$C$9))^2)<=control!$C$17,\nAND(data!D600<=control!$C$8,data!E600>=control!$C$9,data!D600>=control!$C$10,data!E600<=control!$C$11))","v":false},{"$f":"IF($C624,data!D600,NA())","v":{"$error":"#N/A"}},{"$f":"IF($C624,data!E600,NA())","v":{"$error":"#N/A"}},{"$f":"IF($C624,data!F600,0)","v":0}]
[null,{"$f":"data!B601","v":"Worcester"},{"$f":"CHOOSE(mySelectionType,\nSQRT((data!D601-control!$C$8)^2+(myAspectRatio*(data!E601-control!$C$9))^2)<=control!$C$17,\nAND(data!D601<=control!$C$8,data!E601>=control!$C$9,data!D601>=control!$C$10,data!E601<=control!$C$11))","v":false},{"$f":"IF($C625,data!D601,NA())","v":{"$error":"#N/A"}},{"$f":"IF($C625,data!E601,NA())","v":{"$error":"#N/A"}},{"$f":"IF($C625,data!F601,0)","v":0}]
[null,{"$f":"data!B602","v":"Horad Barysaw"},{"$f":"CHOOSE(mySelectionType,\nSQRT((data!D602-control!$C$8)^2+(myAspectRatio*(data!E602-control!$C$9))^2)<=control!$C$17,\nAND(data!D602<=control!$C$8,data!E602>=control!$C$9,data!D602>=control!$C$10,data!E602<=control!$C$11))","v":true},{"$f":"IF($C626,data!D602,NA())","v":54.227899999999998},{"$f":"IF($C626,data!E602,NA())","v":28.504999999999999},{"$f":"IF($C626,data!F602,0)","v":100000}]
[null,{"$f":"data!B603","v":"Kamieniec Podolski"},{"$f":"CHOOSE(mySelectionType,\nSQRT((data!D603-control!$C$8)^2+(myAspectRatio*(data!E603-control!$C$9))^2)<=control!$C$17,\nAND(data!D603<=control!$C$8,data!E603>=control!$C$9,data!D603>=control!$C$10,data!E603<=control!$C$11))","v":true},{"$f":"IF($C627,data!D603,NA())","v":48.6845},{"$f":"IF($C627,data!E603,NA())","v":26.58559},{"$f":"IF($C627,data!F603,0)","v":100000}]
[null,{"$f":"data!B604","v":"Subotica"},{"$f":"CHOOSE(mySelectionType,\nSQRT((data!D604-control!$C$8)^2+(myAspectRatio*(data!E604-control!$C$9))^2)<=control!$C$17,\nAND(data!D604<=control!$C$8,data!E604>=control!$C$9,data!D604>=control!$C$10,data!E604<=control!$C$11))","v":true},{"$f":"IF($C628,data!D604,NA())","v":46.1},{"$f":"IF($C628,data!E604,NA())","v":19.66667},{"$f":"IF($C628,data!F604,0)","v":100000}]
[]
[null,"Data preparation for sorted bar charts"]
[]
[null,"Country","Index","Count","Population","Dummy I","Dummy C","Dummy P","Position C","Position P","Country Count","Count","Country Population","Population"]
[null,"Albania",1,{"$f":"COUNTIFS(data!$C$5:$C$604,control!$B633,control!$F$29:$F$628,\">0\")","v":3},{"$f":"SUMIF(data!$C$5:$C$604,control!$B633,$F$29:$F$628)","v":597738},38,{"$f":"D633+F633/1000000000","v":3.000000038},{"$f":"E633+F633/1000000000","v":597738.00000003795},{"$f":"MATCH(LARGE($G$633:$G$670,$C633),$G$633:$G$670,0)","v":13},{"$f":"MATCH(LARGE($H$633:$H$670,$C633),$H$633:$H$670,0)","v":36},{"$f":"INDEX($B$633:$B$670,I633,1)","v":"Germany"},{"$f":"INDEX($D$633:$D$670,I633,1)","v":50},{"$f":"INDEX($B$633:$B$670,J633,1)","v":"Turkey"},{"$f":"INDEX($E$633:$E$670,J633,1)","v":17229043}]
[null,"Austria",2,{"$f":"COUNTIFS(data!$C$5:$C$604,control!$B634,control!$F$29:$F$628,\">0\")","v":5},{"$f":"SUMIF(data!$C$5:$C$604,control!$B634,$F$29:$F$628)","v":2357692},37,{"$f":"D634+F634/1000000000","v":5.0000000370000004},{"$f":"E634+F634/1000000000","v":2357692.0000000368},27,13,{"$f":"INDEX($B$633:$B$670,I634,1)","v":"Poland"},{"$f":"INDEX($D$633:$D$670,I634,1)","v":39},{"$f":"INDEX($B$633:$B$670,J634,1)","v":"Germany"},{"$f":"INDEX($E$633:$E$670,J634,1)","v":17223544}]
[null,"Belarus",3,{"$f":"COUNTIFS(data!$C$5:$C$604,control!$B635,control!$F$29:$F$628,\">0\")","v":15},{"$f":"SUMIF(data!$C$5:$C$604,control!$B635,$F$29:$F$628)","v":4714404},36,15.000000035999999,4714404.0000000363,37,37,"Ukraine",31,"Ukraine",13443346]
[null,"Belgium",4,{"$f":"COUNTIFS(data!$C$5:$C$604,control!$B636,control!$F$29:$F$628,\">0\")","v":0},{"$f":"SUMIF(data!$C$5:$C$604,control!$B636,$F$29:$F$628)","v":0},35,3.5000000000000002E-8,3.5000000000000002E-8,18,27,"Italy",27,"Poland",11072801]
[null,"Bosnia and Herzegovina",5,{"$f":"COUNTIFS(data!$C$5:$C$604,control!$B637,control!$F$29:$F$628,\">0\")","v":5},{"$f":"SUMIF(data!$C$5:$C$604,control!$B637,$F$29:$F$628)","v":1329264},34,5.0000000340000001,1329264.000000034,29,18,"Romania",26,"Italy",9074275]
[null,"Bulgaria",6,{"$f":"COUNTIFS(data!$C$5:$C$604,control!$B638,control!$F$29:$F$628,\">0\")","v":7},{"$f":"SUMIF(data!$C$5:$C$604,control!$B638,$F$29:$F$628)","v":2420130},33,7.0000000330000001,2420130.0000000331,3,29,"Belarus",15,"Romania",6616861]
[null,"Croatia",7,{"$f":"COUNTIFS(data!$C$5:$C$604,control!$B639,control!$F$29:$F$628,\">0\")","v":3},{"$f":"SUMIF(data!$C$5:$C$604,control!$B639,$F$29:$F$628)","v":1016452},32,3.000000032,1016452.000000032,36,3,"Turkey",15,"Belarus",4714404]
[null,"Czech Republic",8,{"$f":"COUNTIFS(data!$C$5:$C$604,control!$B640,control!$F$29:$F$628,\">0\")","v":5},{"$f":"SUMIF(data!$C$5:$C$604,control!$B640,$F$29:$F$628)","v":2113676},31,5.0000000309999999,2113676.0000000312,15,15,"Hungary",9,"Hungary",2895344]
[null,"Denmark",9,{"$f":"COUNTIFS(data!$C$5:$C$604,control!$B641,control!$F$29:$F$628,\">0\")","v":2},{"$f":"SUMIF(data!$C$5:$C$604,control!$B641,$F$29:$F$628)","v":1299546},30,2.0000000299999998,1299546.00000003,6,6,"Bulgaria",7,"Bulgaria",2420130]
[null,"Estonia",10,{"$f":"COUNTIFS(data!$C$5:$C$604,control!$B642,control!$F$29:$F$628,\">0\")","v":2},{"$f":"SUMIF(data!$C$5:$C$604,control!$B642,$F$29:$F$628)","v":495116},29,2.0000000290000002,495116.00000002899,14,2,"Greece",7,"Austria",2357692]
[null,"Finland",11,{"$f":"COUNTIFS(data!$C$5:$C$604,control!$B643,control!$F$29:$F$628,\">0\")","v":4},{"$f":"SUMIF(data!$C$5:$C$604,control!$B643,$F$29:$F$628)","v":1181220},28,4.0000000279999997,1181220.0000000279,30,8,"Serbia",6,"Czech Republic",2113676]
[null,"France",12,{"$f":"COUNTIFS(data!$C$5:$C$604,control!$B644,control!$F$29:$F$628,\">0\")","v":1},{"$f":"SUMIF(data!$C$5:$C$604,control!$B644,$F$29:$F$628)","v":274845},27,1.000000027,274845.00000002701,2,30,"Austria",5,"Serbia",2103596]
[null,"Germany",13,{"$f":"COUNTIFS(data!$C$5:$C$604,control!$B645,control!$F$29:$F$628,\">0\")","v":50},{"$f":"SUMIF(data!$C$5:$C$604,control!$B645,$F$29:$F$628)","v":17223544},26,50.000000026000002,17223544.000000026,5,34,"Bosnia and Herzegovina",5,"Sweden",1749785]
[null,"Greece",14,{"$f":"COUNTIFS(data!$C$5:$C$604,control!$B646,control!$F$29:$F$628,\">0\")","v":7},{"$f":"SUMIF(data!$C$5:$C$604,control!$B646,$F$29:$F$628)","v":1714764},25,7.0000000250000003,1714764.0000000249,8,14,"Czech Republic",5,"Greece",1714764]
[null,"Hungary",15,{"$f":"COUNTIFS(data!$C$5:$C$604,control!$B647,control!$F$29:$F$628,\">0\")","v":9},{"$f":"SUMIF(data!$C$5:$C$604,control!$B647,$F$29:$F$628)","v":2895344},24,{"$f":"D647+F647/1000000000","v":9.0000000240000002},{"$f":"E647+F647/1000000000","v":2895344.0000000242},21,21,{"$f":"INDEX($B$633:$B$670,I647,1)","v":"Lithuania"},{"$f":"INDEX($D$633:$D$670,I647,1)","v":5},{"$f":"INDEX($B$633:$B$670,J647,1)","v":"Lithuania"},{"$f":"INDEX($E$633:$E$670,J647,1)","v":1357298}]
[null,"Iceland",16,{"$f":"COUNTIFS(data!$C$5:$C$604,control!$B648,control!$F$29:$F$628,\">0\")","v":0},{"$f":"SUMIF(data!$C$5:$C$604,control!$B648,$F$29:$F$628)","v":0},23,2.3000000000000001E-8,2.3000000000000001E-8,11,5,"Finland",4,"Bosnia and Herzegovina",1329264]
[null,"Ireland",17,{"$f":"COUNTIFS(data!$C$5:$C$604,control!$B649,control!$F$29:$F$628,\">0\")","v":0},{"$f":"SUMIF(data!$C$5:$C$604,control!$B649,$F$29:$F$628)","v":0},22,2.1999999999999998E-8,2.1999999999999998E-8,23,9,"Moldova, Republic of",4,"Denmark",1299546]
[null,"Italy",18,{"$f":"COUNTIFS(data!$C$5:$C$604,control!$B650,control!$F$29:$F$628,\">0\")","v":27},{"$f":"SUMIF(data!$C$5:$C$604,control!$B650,$F$29:$F$628)","v":9074275},21,27.000000021000002,9074275.0000000205,34,11,"Sweden",4,"Finland",1181220]
[null,"Kosovo",19,{"$f":"COUNTIFS(data!$C$5:$C$604,control!$B651,control!$F$29:$F$628,\">0\")","v":3},{"$f":"SUMIF(data!$C$5:$C$604,control!$B651,$F$29:$F$628)","v":828509},20,3.0000000199999999,828509.00000002002,1,23,"Albania",3,"Moldova, Republic of",1028169]
[null,"Latvia",20,{"$f":"COUNTIFS(data!$C$5:$C$604,control!$B652,control!$F$29:$F$628,\">0\")","v":2},{"$f":"SUMIF(data!$C$5:$C$604,control!$B652,$F$29:$F$628)","v":854136},19,2.0000000189999998,854136.00000001898,7,7,"Croatia",3,"Croatia",1016452]
[null,"Lithuania",21,{"$f":"COUNTIFS(data!$C$5:$C$604,control!$B653,control!$F$29:$F$628,\">0\")","v":5},{"$f":"SUMIF(data!$C$5:$C$604,control!$B653,$F$29:$F$628)","v":1357298},18,5.0000000179999997,1357298.0000000179,19,20,"Kosovo",3,"Latvia",854136]
[null,"Macedonia",22,{"$f":"COUNTIFS(data!$C$5:$C$604,control!$B654,control!$F$29:$F$628,\">0\")","v":1},{"$f":"SUMIF(data!$C$5:$C$604,control!$B654,$F$29:$F$628)","v":474889},17,1.0000000170000001,474889.000000017,9,19,"Denmark",2,"Kosovo",828509]
[null,"Moldova, Republic of",23,{"$f":"COUNTIFS(data!$C$5:$C$604,control!$B655,control!$F$29:$F$628,\">0\")","v":4},{"$f":"SUMIF(data!$C$5:$C$604,control!$B655,$F$29:$F$628)","v":1028169},16,4.0000000160000004,1028169.0000000159,10,31,"Estonia",2,"Slovakia",660300]
[null,"Montenegro",24,{"$f":"COUNTIFS(data!$C$5:$C$604,control!$B656,control!$F$29:$F$628,\">0\")","v":1},{"$f":"SUMIF(data!$C$5:$C$604,control!$B656,$F$29:$F$628)","v":136473},15,1.0000000149999999,136473.00000001499,20,1,"Latvia",2,"Albania",597738]
[null,"Netherlands",25,{"$f":"COUNTIFS(data!$C$5:$C$604,control!$B657,control!$F$29:$F$628,\">0\")","v":0},{"$f":"SUMIF(data!$C$5:$C$604,control!$B657,$F$29:$F$628)","v":0},14,1.4E-8,1.4E-8,31,10,"Slovakia",2,"Estonia",495116]
[null,"Norway",26,{"$f":"COUNTIFS(data!$C$5:$C$604,control!$B658,control!$F$29:$F$628,\">0\")","v":0},{"$f":"SUMIF(data!$C$5:$C$604,control!$B658,$F$29:$F$628)","v":0},13,1.3000000000000001E-8,1.3000000000000001E-8,12,22,"France",1,"Macedonia",474889]
[null,"Poland",27,{"$f":"COUNTIFS(data!$C$5:$C$604,control!$B659,control!$F$29:$F$628,\">0\")","v":39},{"$f":"SUMIF(data!$C$5:$C$604,control!$B659,$F$29:$F$628)","v":11072801},12,39.000000012000001,11072801.000000011,22,35,"Macedonia",1,"Switzerland",341730]
[null,"Portugal",28,{"$f":"COUNTIFS(data!$C$5:$C$604,control!$B660,control!$F$29:$F$628,\">0\")","v":0},{"$f":"SUMIF(data!$C$5:$C$604,control!$B660,$F$29:$F$628)","v":0},11,1.0999999999999999E-8,1.0999999999999999E-8,24,12,"Montenegro",1,"France",274845]
[null,"Romania",29,{"$f":"COUNTIFS(data!$C$5:$C$604,control!$B661,control!$F$29:$F$628,\">0\")","v":26},{"$f":"SUMIF(data!$C$5:$C$604,control!$B661,$F$29:$F$628)","v":6616861},10,26.000000010000001,6616861.0000000102,32,32,"Slovenia",1,"Slovenia",272220]
[null,"Serbia",30,{"$f":"COUNTIFS(data!$C$5:$C$604,control!$B662,control!$F$29:$F$628,\">0\")","v":6},{"$f":"SUMIF(data!$C$5:$C$604,control!$B662,$F$29:$F$628)","v":2103596},9,6.0000000089999999,2103596.0000000088,35,24,"Switzerland",1,"Montenegro",136473]
[null,"Slovakia",31,{"$f":"COUNTIFS(data!$C$5:$C$604,control!$B663,control!$F$29:$F$628,\">0\")","v":2},{"$f":"SUMIF(data!$C$5:$C$604,control!$B663,$F$29:$F$628)","v":660300},8,2.0000000080000002,660300.00000000803,4,4,"Belgium",0,"Belgium",0]
[null,"Slovenia",32,{"$f":"COUNTIFS(data!$C$5:$C$604,control!$B664,control!$F$29:$F$628,\">0\")","v":1},{"$f":"SUMIF(data!$C$5:$C$604,control!$B664,$F$29:$F$628)","v":272220},7,1.0000000069999999,272220.00000000698,16,16,"Iceland",0,"Iceland",0]
[null,"Spain",33,{"$f":"COUNTIFS(data!$C$5:$C$604,control!$B665,control!$F$29:$F$628,\">0\")","v":0},{"$f":"SUMIF(data!$C$5:$C$604,control!$B665,$F$29:$F$628)","v":0},6,6E-9,6E-9,17,17,"Ireland",0,"Ireland",0]
[null,"Sweden",34,{"$f":"COUNTIFS(data!$C$5:$C$604,control!$B666,control!$F$29:$F$628,\">0\")","v":4},{"$f":"SUMIF(data!$C$5:$C$604,control!$B666,$F$29:$F$628)","v":1749785},5,4.0000000050000004,1749785.0000000049,25,25,"Netherlands",0,"Netherlands",0]
[null,"Switzerland",35,{"$f":"COUNTIFS(data!$C$5:$C$604,control!$B667,control!$F$29:$F$628,\">0\")","v":1},{"$f":"SUMIF(data!$C$5:$C$604,control!$B667,$F$29:$F$628)","v":341730},4,1.0000000040000001,341730.00000000402,26,26,"Norway",0,"Norway",0]
[null,"Turkey",36,{"$f":"COUNTIFS(data!$C$5:$C$604,control!$B668,control!$F$29:$F$628,\">0\")","v":15},{"$f":"SUMIF(data!$C$5:$C$604,control!$B668,$F$29:$F$628)","v":17229043},3,15.000000003,17229043.000000004,28,28,"Portugal",0,"Portugal",0]
[null,"Ukraine",37,{"$f":"COUNTIFS(data!$C$5:$C$604,control!$B669,control!$F$29:$F$628,\">0\")","v":31},{"$f":"SUMIF(data!$C$5:$C$604,control!$B669,$F$29:$F$628)","v":13443346},2,31.000000002,13443346.000000002,33,33,"Spain",0,"Spain",0]
[null,"United Kingdom",38,{"$f":"COUNTIFS(data!$C$5:$C$604,control!$B670,control!$F$29:$F$628,\">0\")","v":0},{"$f":"SUMIF(data!$C$5:$C$604,control!$B670,$F$29:$F$628)","v":0},1,1.0000000000000001E-9,1.0000000000000001E-9,38,38,"United Kingdom",0,"United Kingdom",0]