{"text_format":"1","workbook":"xlsx","n_sheets":3,"sheets":["map","data","control"],"not_rendered":{"charts":3,"images":1,"macros":1,"external_links":0,"defined_names":3,"comments":0,"pivot_tables":0},"unopened":[],"bounds":{"document_bytes":16777216,"sheet_cells":100000,"rows_first":2000,"rows_last":500,"rows_between":2000,"halvings":0,"cell_chars":16384,"cell_head_chars":4096},"cells_cut":0,"cells_raw":0,"read":"whole","date_system":"1900"}

{"sheet":"map","index":0,"n_rows":14,"n_cols":11,"rows_kept":14,"cut":false,"hidden":false,"merged":[[12,7,12,10],[13,7,13,8],[13,9,13,11]]}
[]
[null,"Select and Highlight Areas on a Chart",null,null,null,"European cities (more than 100k inhabitants)",null,null,null,null,"www.cs-analytics.de"]
[]
[null,"Selected Cities",{"$f":"control!C21","v":286},"Not selected Cities",{"$f":"control!C22","v":314},null,null,"Total Population",{"$f":"control!C23","v":106877166},"Average Population",{"$f":"control!C24","v":373696.38461538462}]
[]
[]
[null,null,null,null,null,null,null,null,"Radial  selection"]
[null,null,null,null,null,null,null,null,"Rectangular selection"]
[]
[null,null,null,null,null,null,null,"Keep SHIFT key pressed and click /drag on the map to select"]
[null,null,null,null,null,null,null,"Release the SHIFT key and click on the map again to deselect"]
[]
[null,null,null,null,null,null,null,"Top 15 countries selected "]
[null,null,null,null,null,null,null,"by selected cities",null,"by population in million"]

{"sheet":"data","index":1,"n_rows":604,"n_cols":6,"rows_kept":604,"cut":false,"hidden":false,"merged":[]}
[]
[null,"Data",null,"source:","www.geonames.org"]
[]
[null,"City","Country","Latitude","Longitude","Population"]
[null,"İstanbul","Turkey",41.013840000000002,28.949660000000002,11174257]
[null,"London","United Kingdom",51.50853,-0.12573999999999999,7556900]
[null,"Ankara","Turkey",39.919870000000003,32.85427,3517182]
[null,"Berlin","Germany",52.524369999999998,13.41053,3426354]
[null,"Madrid","Spain",40.416499999999999,-3.7025600000000001,3255944]
[null,"Kiev","Ukraine",50.454659999999997,30.523800000000001,2797553]
[null,"İzmir","Turkey",38.412730000000003,27.138380000000002,2500603]
[null,"Rome","Italy",41.891930000000002,12.511329999999999,2318895]
[null,"Paris","France",48.853409999999997,2.3488000000000002,2138551]
[null,"Bucharest","Romania",44.432250000000003,26.106259999999999,1877155]
[null,"Minsk","Belarus",53.9,27.566669999999998,1742124]
[null,"Budapest","Hungary",47.498010000000001,19.039909999999999,1741041]
[null,"Hamburg","Germany",53.575319999999998,10.01534,1739117]
[null,"Warsaw","Poland",52.229770000000002,21.011780000000002,1702139]
[null,"Vienna","Austria",48.208489999999998,16.37208,1691468]
[null,"Barcelona","Spain",41.38879,2.1589900000000002,1621537]
[null,"Kharkiv","Ukraine",49.980809999999998,36.252719999999997,1430885]
[null,"Bursa","Turkey",40.192659999999997,29.084029999999998,1412701]
[null,"Belgrade","Serbia",44.804009999999998,20.465129999999998,1273651]
[null,"Munich","Germany",48.137430000000002,11.57549,1260391]
[null,"Stockholm","Sweden",59.33258,18.064900000000002,1253309]
[null,"Adana","Turkey",37.001669999999997,35.328890000000001,1248988]
[null,"Milano","Italy",45.464269999999999,9.1895100000000003,1236837]
[null,"Prague","Czech Republic",50.088039999999999,14.42076,1165581]
[null,"Copenhagen","Denmark",55.675939999999997,12.565530000000001,1153615]
[null,"Sofia","Bulgaria",42.697510000000001,23.324149999999999,1152556]
[null,"Gaziantep","Turkey",37.059440000000002,37.3825,1065975]
[null,"Dnipropetrovsk","Ukraine",48.45,34.983330000000002,1032822]
[null,"Donetsk","Ukraine",48.023000000000003,37.802239999999998,1024700]
[null,"Dublin","Ireland",53.333060000000003,-6.2488900000000003,1024027]
[null,"Brussels","Belgium",50.850450000000002,4.3487799999999996,1019022]
[null,"Odessa","Ukraine",46.477469999999997,30.732620000000001,1001558]
[null,"Birmingham","United Kingdom",52.48142,-1.8998299999999999,984333]
[null,"Cologne","Germany",50.933329999999998,6.95,963395]
[null,"Napoli","Italy",40.856310000000001,14.246409999999999,959470]
[null,"Konya","Turkey",37.87135,32.484639999999999,875530]
[null,"Turin","Italy",45.070489999999999,7.68682,870456]
[null,"Valencia","Spain",39.469749999999998,-0.37739,814208]
[null,"Zaporizhzhya","Ukraine",47.822890000000001,35.190309999999997,796217]
[null,"Marseille","France",43.296950000000002,5.3810700000000002,794811]
[null,"Łódź","Poland",51.75,19.466670000000001,768755]
[null,"Antalya","Turkey",36.908119999999997,30.69556,758188]
[null,"Kraków","Poland",50.061430000000001,19.936579999999999,755050]
[null,"Riga","Latvia",56.945999999999998,24.105889999999999,742572]
[null,"Amsterdam","Netherlands",52.374029999999998,4.8896899999999999,741636]
[null,"L'viv","Ukraine",49.838259999999998,24.023240000000001,717803]
[null,"Sevilla","Spain",37.382829999999998,-5.9731699999999996,703206]
[null,"Zagreb","Croatia",45.814439999999998,15.977980000000001,698966]
[null,"Sarajevo","Bosnia and Herzegovina",43.848640000000003,18.356439999999999,696731]
[null,"Zaragoza","Spain",41.656059999999997,-0.87734000000000001,674317]
[null,"Athens","Greece",37.97945,23.71622,664046]
[null,"Kryvyi Rih","Ukraine",47.909660000000002,33.38044,652380]
[null,"Frankfurt am Main","Germany",50.115519999999997,8.6841699999999999,650000]
[null,"Palermo","Italy",38.13205,13.335610000000001,648260]
[null,"Chişinău","Moldova, Republic of",47.005560000000003,28.857500000000002,635994]
[null,"Wrocław","Poland",51.1,17.033329999999999,634893]
{"$rows_left_out":545}
{"sheet":"control","index":2,"n_rows":670,"n_cols":14,"rows_kept":670,"cut":false,"hidden":false,"merged":[]}
[]
[null,"Control and Calculations",null,null,null,null,null,null,null,null,null,null,null,"www.cs-analytics.de"]
[]
[null,"Control parameters handled by option buttons and code"]
[]
[null,"Selection type",1]
[]
[null,"Start / Center Lat",49.060588235294119]
[null,"Start / Center Long",21.567157001414429]
[null,"Select Lat",58.257882352941181]
[null,"Select Long",13.062644978783595]
[]
[null,"Aspect Ratio",0.84158414602279663]
[]
[null,"Geometrical calculations"]
[]
[null,"Radius",{"$f":"SQRT((C10-C8)^2+(myAspectRatio*(C11-C9))^2)","v":11.654039016894401}]
[]
[null,"Displayed Measures"]
[]
[null,"Count selected",{"$f":"COUNTIF($F$29:$F$628,\">0\")","v":286}]
[null,"Count unselected",{"$f":"COUNTA(data!$B$5:$B$604)-C21","v":314}]
[null,"Total Population in m",{"$f":"SUM(F29:F628)","v":106877166}]
[null,"Average Population in 000",{"$f":"IFERROR(C23/C21,\"\")","v":373696.38461538462}]
[]
[null,"Selected cities"]
[]
[null,"City","Selected","Latitude","Longitude","Population"]
[null,{"$f":"data!B5","v":"İstanbul"},{"$f":"CHOOSE(mySelectionType,\nSQRT((data!D5-control!$C$8)^2+(myAspectRatio*(data!E5-control!$C$9))^2)<=control!$C$17,\nAND(data!D5<=control!$C$8,data!E5>=control!$C$9,data!D5>=control!$C$10,data!E5<=control!$C$11))","v":true},{"$f":"IF($C29,data!D5,NA())","v":41.013840000000002},{"$f":"IF($C29,data!E5,NA())","v":28.949660000000002},{"$f":"IF($C29,data!F5,0)","v":11174257}]
[null,{"$f":"data!B6","v":"London"},{"$f":"CHOOSE(mySelectionType,\nSQRT((data!D6-control!$C$8)^2+(myAspectRatio*(data!E6-control!$C$9))^2)<=control!$C$17,\nAND(data!D6<=control!$C$8,data!E6>=control!$C$9,data!D6>=control!$C$10,data!E6<=control!$C$11))","v":false},{"$f":"IF($C30,data!D6,NA())","v":{"$error":"#N/A"}},{"$f":"IF($C30,data!E6,NA())","v":{"$error":"#N/A"}},{"$f":"IF($C30,data!F6,0)","v":0}]
[null,{"$f":"data!B7","v":"Ankara"},{"$f":"CHOOSE(mySelectionType,\nSQRT((data!D7-control!$C$8)^2+(myAspectRatio*(data!E7-control!$C$9))^2)<=control!$C$17,\nAND(data!D7<=control!$C$8,data!E7>=control!$C$9,data!D7>=control!$C$10,data!E7<=control!$C$11))","v":false},{"$f":"IF($C31,data!D7,NA())","v":{"$error":"#N/A"}},{"$f":"IF($C31,data!E7,NA())","v":{"$error":"#N/A"}},{"$f":"IF($C31,data!F7,0)","v":0}]
[null,{"$f":"data!B8","v":"Berlin"},{"$f":"CHOOSE(mySelectionType,\nSQRT((data!D8-control!$C$8)^2+(myAspectRatio*(data!E8-control!$C$9))^2)<=control!$C$17,\nAND(data!D8<=control!$C$8,data!E8>=control!$C$9,data!D8>=control!$C$10,data!E8<=control!$C$11))","v":true},{"$f":"IF($C32,data!D8,NA())","v":52.524369999999998},{"$f":"IF($C32,data!E8,NA())","v":13.41053},{"$f":"IF($C32,data!F8,0)","v":3426354}]
[null,{"$f":"data!B9","v":"Madrid"},{"$f":"CHOOSE(mySelectionType,\nSQRT((data!D9-control!$C$8)^2+(myAspectRatio*(data!E9-control!$C$9))^2)<=control!$C$17,\nAND(data!D9<=control!$C$8,data!E9>=control!$C$9,data!D9>=control!$C$10,data!E9<=control!$C$11))","v":false},{"$f":"IF($C33,data!D9,NA())","v":{"$error":"#N/A"}},{"$f":"IF($C33,data!E9,NA())","v":{"$error":"#N/A"}},{"$f":"IF($C33,data!F9,0)","v":0}]
[null,{"$f":"data!B10","v":"Kiev"},{"$f":"CHOOSE(mySelectionType,\nSQRT((data!D10-control!$C$8)^2+(myAspectRatio*(data!E10-control!$C$9))^2)<=control!$C$17,\nAND(data!D10<=control!$C$8,data!E10>=control!$C$9,data!D10>=control!$C$10,data!E10<=control!$C$11))","v":true},{"$f":"IF($C34,data!D10,NA())","v":50.454659999999997},{"$f":"IF($C34,data!E10,NA())","v":30.523800000000001},{"$f":"IF($C34,data!F10,0)","v":2797553}]
[null,{"$f":"data!B11","v":"İzmir"},{"$f":"CHOOSE(mySelectionType,\nSQRT((data!D11-control!$C$8)^2+(myAspectRatio*(data!E11-control!$C$9))^2)<=control!$C$17,\nAND(data!D11<=control!$C$8,data!E11>=control!$C$9,data!D11>=control!$C$10,data!E11<=control!$C$11))","v":true},{"$f":"IF($C35,data!D11,NA())","v":38.412730000000003},{"$f":"IF($C35,data!E11,NA())","v":27.138380000000002},{"$f":"IF($C35,data!F11,0)","v":2500603}]
[null,{"$f":"data!B12","v":"Rome"},{"$f":"CHOOSE(mySelectionType,\nSQRT((data!D12-control!$C$8)^2+(myAspectRatio*(data!E12-control!$C$9))^2)<=control!$C$17,\nAND(data!D12<=control!$C$8,data!E12>=control!$C$9,data!D12>=control!$C$10,data!E12<=control!$C$11))","v":true},{"$f":"IF($C36,data!D12,NA())","v":41.891930000000002},{"$f":"IF($C36,data!E12,NA())","v":12.511329999999999},{"$f":"IF($C36,data!F12,0)","v":2318895}]
[null,{"$f":"data!B13","v":"Paris"},{"$f":"CHOOSE(mySelectionType,\nSQRT((data!D13-control!$C$8)^2+(myAspectRatio*(data!E13-control!$C$9))^2)<=control!$C$17,\nAND(data!D13<=control!$C$8,data!E13>=control!$C$9,data!D13>=control!$C$10,data!E13<=control!$C$11))","v":false},{"$f":"IF($C37,data!D13,NA())","v":{"$error":"#N/A"}},{"$f":"IF($C37,data!E13,NA())","v":{"$error":"#N/A"}},{"$f":"IF($C37,data!F13,0)","v":0}]
[null,{"$f":"data!B14","v":"Bucharest"},{"$f":"CHOOSE(mySelectionType,\nSQRT((data!D14-control!$C$8)^2+(myAspectRatio*(data!E14-control!$C$9))^2)<=control!$C$17,\nAND(data!D14<=control!$C$8,data!E14>=control!$C$9,data!D14>=control!$C$10,data!E14<=control!$C$11))","v":true},{"$f":"IF($C38,data!D14,NA())","v":44.432250000000003},{"$f":"IF($C38,data!E14,NA())","v":26.106259999999999},{"$f":"IF($C38,data!F14,0)","v":1877155}]
[null,{"$f":"data!B15","v":"Minsk"},{"$f":"CHOOSE(mySelectionType,\nSQRT((data!D15-control!$C$8)^2+(myAspectRatio*(data!E15-control!$C$9))^2)<=control!$C$17,\nAND(data!D15<=control!$C$8,data!E15>=control!$C$9,data!D15>=control!$C$10,data!E15<=control!$C$11))","v":true},{"$f":"IF($C39,data!D15,NA())","v":53.9},{"$f":"IF($C39,data!E15,NA())","v":27.566669999999998},{"$f":"IF($C39,data!F15,0)","v":1742124}]
[null,{"$f":"data!B16","v":"Budapest"},{"$f":"CHOOSE(mySelectionType,\nSQRT((data!D16-control!$C$8)^2+(myAspectRatio*(data!E16-control!$C$9))^2)<=control!$C$17,\nAND(data!D16<=control!$C$8,data!E16>=control!$C$9,data!D16>=control!$C$10,data!E16<=control!$C$11))","v":true},{"$f":"IF($C40,data!D16,NA())","v":47.498010000000001},{"$f":"IF($C40,data!E16,NA())","v":19.039909999999999},{"$f":"IF($C40,data!F16,0)","v":1741041}]
[null,{"$f":"data!B17","v":"Hamburg"},{"$f":"CHOOSE(mySelectionType,\nSQRT((data!D17-control!$C$8)^2+(myAspectRatio*(data!E17-control!$C$9))^2)<=control!$C$17,\nAND(data!D17<=control!$C$8,data!E17>=control!$C$9,data!D17>=control!$C$10,data!E17<=control!$C$11))","v":true},{"$f":"IF($C41,data!D17,NA())","v":53.575319999999998},{"$f":"IF($C41,data!E17,NA())","v":10.01534},{"$f":"IF($C41,data!F17,0)","v":1739117}]
[null,{"$f":"data!B18","v":"Warsaw"},{"$f":"CHOOSE(mySelectionType,\nSQRT((data!D18-control!$C$8)^2+(myAspectRatio*(data!E18-control!$C$9))^2)<=control!$C$17,\nAND(data!D18<=control!$C$8,data!E18>=control!$C$9,data!D18>=control!$C$10,data!E18<=control!$C$11))","v":true},{"$f":"IF($C42,data!D18,NA())","v":52.229770000000002},{"$f":"IF($C42,data!E18,NA())","v":21.011780000000002},{"$f":"IF($C42,data!F18,0)","v":1702139}]
[null,{"$f":"data!B19","v":"Vienna"},{"$f":"CHOOSE(mySelectionType,\nSQRT((data!D19-control!$C$8)^2+(myAspectRatio*(data!E19-control!$C$9))^2)<=control!$C$17,\nAND(data!D19<=control!$C$8,data!E19>=control!$C$9,data!D19>=control!$C$10,data!E19<=control!$C$11))","v":true},{"$f":"IF($C43,data!D19,NA())","v":48.208489999999998},{"$f":"IF($C43,data!E19,NA())","v":16.37208},{"$f":"IF($C43,data!F19,0)","v":1691468}]
[null,{"$f":"data!B20","v":"Barcelona"},{"$f":"CHOOSE(mySelectionType,\nSQRT((data!D20-control!$C$8)^2+(myAspectRatio*(data!E20-control!$C$9))^2)<=control!$C$17,\nAND(data!D20<=control!$C$8,data!E20>=control!$C$9,data!D20>=control!$C$10,data!E20<=control!$C$11))","v":false},{"$f":"IF($C44,data!D20,NA())","v":{"$error":"#N/A"}},{"$f":"IF($C44,data!E20,NA())","v":{"$error":"#N/A"}},{"$f":"IF($C44,data!F20,0)","v":0}]
[null,{"$f":"data!B21","v":"Kharkiv"},{"$f":"CHOOSE(mySelectionType,\nSQRT((data!D21-control!$C$8)^2+(myAspectRatio*(data!E21-control!$C$9))^2)<=control!$C$17,\nAND(data!D21<=control!$C$8,data!E21>=control!$C$9,data!D21>=control!$C$10,data!E21<=control!$C$11))","v":false},{"$f":"IF($C45,data!D21,NA())","v":{"$error":"#N/A"}},{"$f":"IF($C45,data!E21,NA())","v":{"$error":"#N/A"}},{"$f":"IF($C45,data!F21,0)","v":0}]
[null,{"$f":"data!B22","v":"Bursa"},{"$f":"CHOOSE(mySelectionType,\nSQRT((data!D22-control!$C$8)^2+(myAspectRatio*(data!E22-control!$C$9))^2)<=control!$C$17,\nAND(data!D22<=control!$C$8,data!E22>=control!$C$9,data!D22>=control!$C$10,data!E22<=control!$C$11))","v":true},{"$f":"IF($C46,data!D22,NA())","v":40.192659999999997},{"$f":"IF($C46,data!E22,NA())","v":29.084029999999998},{"$f":"IF($C46,data!F22,0)","v":1412701}]
[null,{"$f":"data!B23","v":"Belgrade"},{"$f":"CHOOSE(mySelectionType,\nSQRT((data!D23-control!$C$8)^2+(myAspectRatio*(data!E23-control!$C$9))^2)<=control!$C$17,\nAND(data!D23<=control!$C$8,data!E23>=control!$C$9,data!D23>=control!$C$10,data!E23<=control!$C$11))","v":true},{"$f":"IF($C47,data!D23,NA())","v":44.804009999999998},{"$f":"IF($C47,data!E23,NA())","v":20.465129999999998},{"$f":"IF($C47,data!F23,0)","v":1273651}]
[null,{"$f":"data!B24","v":"Munich"},{"$f":"CHOOSE(mySelectionType,\nSQRT((data!D24-control!$C$8)^2+(myAspectRatio*(data!E24-control!$C$9))^2)<=control!$C$17,\nAND(data!D24<=control!$C$8,data!E24>=control!$C$9,data!D24>=control!$C$10,data!E24<=control!$C$11))","v":true},{"$f":"IF($C48,data!D24,NA())","v":48.137430000000002},{"$f":"IF($C48,data!E24,NA())","v":11.57549},{"$f":"IF($C48,data!F24,0)","v":1260391}]
[null,{"$f":"data!B25","v":"Stockholm"},{"$f":"CHOOSE(mySelectionType,\nSQRT((data!D25-control!$C$8)^2+(myAspectRatio*(data!E25-control!$C$9))^2)<=control!$C$17,\nAND(data!D25<=control!$C$8,data!E25>=control!$C$9,data!D25>=control!$C$10,data!E25<=control!$C$11))","v":true},{"$f":"IF($C49,data!D25,NA())","v":59.33258},{"$f":"IF($C49,data!E25,NA())","v":18.064900000000002},{"$f":"IF($C49,data!F25,0)","v":1253309}]
[null,{"$f":"data!B26","v":"Adana"},{"$f":"CHOOSE(mySelectionType,\nSQRT((data!D26-control!$C$8)^2+(myAspectRatio*(data!E26-control!$C$9))^2)<=control!$C$17,\nAND(data!D26<=control!$C$8,data!E26>=control!$C$9,data!D26>=control!$C$10,data!E26<=control!$C$11))","v":false},{"$f":"IF($C50,data!D26,NA())","v":{"$error":"#N/A"}},{"$f":"IF($C50,data!E26,NA())","v":{"$error":"#N/A"}},{"$f":"IF($C50,data!F26,0)","v":0}]
[null,{"$f":"data!B27","v":"Milano"},{"$f":"CHOOSE(mySelectionType,\nSQRT((data!D27-control!$C$8)^2+(myAspectRatio*(data!E27-control!$C$9))^2)<=control!$C$17,\nAND(data!D27<=control!$C$8,data!E27>=control!$C$9,data!D27>=control!$C$10,data!E27<=control!$C$11))","v":true},{"$f":"IF($C51,data!D27,NA())","v":45.464269999999999},{"$f":"IF($C51,data!E27,NA())","v":9.1895100000000003},{"$f":"IF($C51,data!F27,0)","v":1236837}]
[null,{"$f":"data!B28","v":"Prague"},{"$f":"CHOOSE(mySelectionType,\nSQRT((data!D28-control!$C$8)^2+(myAspectRatio*(data!E28-control!$C$9))^2)<=control!$C$17,\nAND(data!D28<=control!$C$8,data!E28>=control!$C$9,data!D28>=control!$C$10,data!E28<=control!$C$11))","v":true},{"$f":"IF($C52,data!D28,NA())","v":50.088039999999999},{"$f":"IF($C52,data!E28,NA())","v":14.42076},{"$f":"IF($C52,data!F28,0)","v":1165581}]
[null,{"$f":"data!B29","v":"Copenhagen"},{"$f":"CHOOSE(mySelectionType,\nSQRT((data!D29-control!$C$8)^2+(myAspectRatio*(data!E29-control!$C$9))^2)<=control!$C$17,\nAND(data!D29<=control!$C$8,data!E29>=control!$C$9,data!D29>=control!$C$10,data!E29<=control!$C$11))","v":true},{"$f":"IF($C53,data!D29,NA())","v":55.675939999999997},{"$f":"IF($C53,data!E29,NA())","v":12.565530000000001},{"$f":"IF($C53,data!F29,0)","v":1153615}]
[null,{"$f":"data!B30","v":"Sofia"},{"$f":"CHOOSE(mySelectionType,\nSQRT((data!D30-control!$C$8)^2+(myAspectRatio*(data!E30-control!$C$9))^2)<=control!$C$17,\nAND(data!D30<=control!$C$8,data!E30>=control!$C$9,data!D30>=control!$C$10,data!E30<=control!$C$11))","v":true},{"$f":"IF($C54,data!D30,NA())","v":42.697510000000001},{"$f":"IF($C54,data!E30,NA())","v":23.324149999999999},{"$f":"IF($C54,data!F30,0)","v":1152556}]
[null,{"$f":"data!B31","v":"Gaziantep"},{"$f":"CHOOSE(mySelectionType,\nSQRT((data!D31-control!$C$8)^2+(myAspectRatio*(data!E31-control!$C$9))^2)<=control!$C$17,\nAND(data!D31<=control!$C$8,data!E31>=control!$C$9,data!D31>=control!$C$10,data!E31<=control!$C$11))","v":false},{"$f":"IF($C55,data!D31,NA())","v":{"$error":"#N/A"}},{"$f":"IF($C55,data!E31,NA())","v":{"$error":"#N/A"}},{"$f":"IF($C55,data!F31,0)","v":0}]
[null,{"$f":"data!B32","v":"Dnipropetrovsk"},{"$f":"CHOOSE(mySelectionType,\nSQRT((data!D32-control!$C$8)^2+(myAspectRatio*(data!E32-control!$C$9))^2)<=control!$C$17,\nAND(data!D32<=control!$C$8,data!E32>=control!$C$9,data!D32>=control!$C$10,data!E32<=control!$C$11))","v":true},{"$f":"IF($C56,data!D32,NA())","v":48.45},{"$f":"IF($C56,data!E32,NA())","v":34.983330000000002},{"$f":"IF($C56,data!F32,0)","v":1032822}]
[null,{"$f":"data!B33","v":"Donetsk"},{"$f":"CHOOSE(mySelectionType,\nSQRT((data!D33-control!$C$8)^2+(myAspectRatio*(data!E33-control!$C$9))^2)<=control!$C$17,\nAND(data!D33<=control!$C$8,data!E33>=control!$C$9,data!D33>=control!$C$10,data!E33<=control!$C$11))","v":false},{"$f":"IF($C57,data!D33,NA())","v":{"$error":"#N/A"}},{"$f":"IF($C57,data!E33,NA())","v":{"$error":"#N/A"}},{"$f":"IF($C57,data!F33,0)","v":0}]
[null,{"$f":"data!B34","v":"Dublin"},{"$f":"CHOOSE(mySelectionType,\nSQRT((data!D34-control!$C$8)^2+(myAspectRatio*(data!E34-control!$C$9))^2)<=control!$C$17,\nAND(data!D34<=control!$C$8,data!E34>=control!$C$9,data!D34>=control!$C$10,data!E34<=control!$C$11))","v":false},{"$f":"IF($C58,data!D34,NA())","v":{"$error":"#N/A"}},{"$f":"IF($C58,data!E34,NA())","v":{"$error":"#N/A"}},{"$f":"IF($C58,data!F34,0)","v":0}]
[null,{"$f":"data!B35","v":"Brussels"},{"$f":"CHOOSE(mySelectionType,\nSQRT((data!D35-control!$C$8)^2+(myAspectRatio*(data!E35-control!$C$9))^2)<=control!$C$17,\nAND(data!D35<=control!$C$8,data!E35>=control!$C$9,data!D35>=control!$C$10,data!E35<=control!$C$11))","v":false},{"$f":"IF($C59,data!D35,NA())","v":{"$error":"#N/A"}},{"$f":"IF($C59,data!E35,NA())","v":{"$error":"#N/A"}},{"$f":"IF($C59,data!F35,0)","v":0}]
[null,{"$f":"data!B36","v":"Odessa"},{"$f":"CHOOSE(mySelectionType,\nSQRT((data!D36-control!$C$8)^2+(myAspectRatio*(data!E36-control!$C$9))^2)<=control!$C$17,\nAND(data!D36<=control!$C$8,data!E36>=control!$C$9,data!D36>=control!$C$10,data!E36<=control!$C$11))","v":true},{"$f":"IF($C60,data!D36,NA())","v":46.477469999999997},{"$f":"IF($C60,data!E36,NA())","v":30.732620000000001},{"$f":"IF($C60,data!F36,0)","v":1001558}]
{"$rows_left_out":610}